{"text_format":"1","workbook":"xlsx","n_sheets":3,"sheets":["Planilla Acciones Básica","Base_Gráficos","Base"],"not_rendered":{"charts":4,"images":2,"macros":1,"external_links":0,"defined_names":25,"comments":0,"pivot_tables":0},"unopened":[],"bounds":{"document_bytes":16777216,"sheet_cells":100000,"rows_first":2000,"rows_last":500,"rows_between":2000,"halvings":0,"cell_chars":16384,"cell_head_chars":4096},"cells_cut":0,"cells_raw":0,"read":"whole","date_system":"1900"}

{"sheet":"Planilla Acciones Básica","index":0,"n_rows":47,"n_cols":22,"rows_kept":47,"cut":false,"hidden":false,"merged":[]}
[]
[]
[null,"Planilla - Acciones Básica",null,null,null,null,null,null,null,null,null,null,null,null,null,null,null,null,"Fecha:",{"$f":"IF(V3=\"\",_xll.ECONOMATICA(\"MERVAL\",\"Date of Last Quote\"),V3)","v":"2020-09-03"}]
[null,"Información General",null,null,null,null,null,null,"Retorno"]
[null,"Nombre",null,null,null,null,{"$f":"IFERROR(INDEX(Base!E:E,MATCH('Planilla Acciones Básica'!G6,Base!B:B,0)),\"\")","v":"Bbva S. A. Ord"},null,"Código","Tipo",{"$f":"EOMONTH(L5,-1)","v":"2020-07-31"},{"$f":"EOMONTH(M5,-1)","v":"2020-08-31"},{"$f":"T3","v":"2020-09-03"},{"$f":"DATE(YEAR($T$3)-2,12,31)","v":"2018-12-31"},{"$f":"DATE(YEAR($T$3)-1,12,31)","v":"2019-12-31"},{"$f":"T3","v":"2020-09-03"},"1d","1w","1m","12m"]
[null,"Código",null,null,null,null,"BBAR",null,{"$f":"IFERROR(_xll.ECONOMATICA(G6&\"<XBue>\",\"ticker\"),\"\")","v":""},{"$f":"IFERROR(_xll.ECONOMATICA(G6&\"<XBue>\",\"Class\"),\"\")","v":""},{"$f":"IFERROR(_xll.ECONOMATICA($G$6&\"<XBue>\",\"return\",\"in the month\",K5,,,,\"decimal\"),\"\")","v":""},{"$f":"IFERROR(_xll.ECONOMATICA($G$6&\"<XBue>\",\"return\",\"in the month\",L5,,,,\"decimal\"),\"\")","v":""},{"$f":"IFERROR(_xll.ECONOMATICA($G$6&\"<XBue>\",\"return\",\"in the month\",M5,,,,\"decimal\"),\"\")","v":""},{"$f":"IFERROR(_xll.ECONOMATICA($G$6&\"<XBue>\",\"return\",\"in the year\",N5,,,,\"decimal\"),\"\")","v":""},{"$f":"IFERROR(_xll.ECONOMATICA($G$6&\"<XBue>\",\"return\",\"in the year\",O5,,,,\"decimal\"),\"\")","v":""},{"$f":"IFERROR(_xll.ECONOMATICA($G$6&\"<XBue>\",\"return\",\"in the year\",P5,,,,\"decimal\"),\"\")","v":""},{"$f":"IFERROR(_xll.ECONOMATICA($G$6&\"<XBue>\",\"return\",Q5,T3,,,,\"decimal\"),\"\")","v":""},{"$f":"IFERROR(_xll.ECONOMATICA($G$6&\"<XBue>\",\"return\",R5,$T$3,,,,\"decimal\"),\"\")","v":""},{"$f":"IFERROR(_xll.ECONOMATICA($G$6&\"<XBue>\",\"return\",S5,$T$3,,,,\"decimal\",\"false\",\"false\"),\"\")","v":""},{"$f":"IFERROR(_xll.ECONOMATICA($G$6&\"<XBue>\",\"return\",T5,$T$3,,,,\"decimal\",\"false\",\"false\"),\"\")","v":""}]
[null,"Sector",null,null,null,null,{"$f":"IFERROR(_xll.ECONOMATICA($G$6&\"<XBue>\",\"Sector NAICS\",,$T$3),\"\")","v":""}]
[null,"Principal Accionista",null,null,null,null,{"$f":"IFERROR(_xll.ECONOMATICA($G$6&\"<XBue>\",\"MainShHol\"),\"\")","v":""},null,"Precio de Acción",null,null,null,null,null,null,"Período:","D",null,"Años","1Y"]
[null,"Acciones Poseídas (Principal Accionista)",null,null,null,null,{"$f":"IFERROR(_xll.ECONOMATICA($G$6&\"<XBue>\",\"ShrsHold\",,,,,,\"decimal\",\"false\",,,{\"std.cac.ccacq=2\";\"std.cac.fam=1\"}),\"\")","v":""}]
[]
[null,"Corizaciones",null,null,"Estadísticas"]
[null,"Cierre",{"$f":"IFERROR(_xll.ECONOMATICA($G$6&\"<XBue>\",\"Close\",,$T$3,,,,,\"false\",\"false\"),\"\")","v":""},null,"Beta (60 meses)",null,{"$f":"IFERROR(_xll.ECONOMATICA($G$6&\"<XBue>\",\"Beta\",,$T$3,,,,,\"false\",\"false\"),\"\")","v":""}]
[null,"Fecha Última Cotización",{"$f":"IFERROR(_xll.ECONOMATICA($G$6&\"<XBue>\",\"Date of Last Quote\",,$T$3,,,\"ORIGINAL CURRENCY\",,\"false\",\"false\"),\"\")","v":""},null,"Correlación (60 meses)",null,{"$f":"IFERROR(_xll.ECONOMATICA($G$6&\"<XBue>\",\"Correlation\",,T3,,,,,\"false\",\"false\"),\"\")","v":""}]
[null,"Máximo (52w)",{"$f":"IFERROR(_xll.ECONOMATICA($G$6&\"<XBue>\",\"High\",\"52w\",$T$3,,,,,\"false\",\"false\"),\"\")","v":""},null,"Volatilidad (1 ano)",null,{"$f":"IFERROR(_xll.ECONOMATICA($G$6&\"<XBue>\",\"Volatility\",\"1y\",T3,,,,,\"false\",\"false\"),\"\")","v":""}]
[null,"Mínimo (52w)",{"$f":"IFERROR(_xll.ECONOMATICA($G$6&\"<XBue>\",\"Low\",\"52w\",$T$3,,,,,\"false\",\"FALSE\"),\"\")","v":""},null,"Sharpe (1 ano)",null,{"$f":"IFERROR(_xll.ECONOMATICA($G$6&\"<XBue>\",\"Sharpe\",\"1y\",T3,,,,,\"false\",\"false\"),\"\")","v":""}]
[null,"Volume Medio (Millones)",{"$f":"IFERROR(_xll.ECONOMATICA($G$6&\"<XBue>\",\"Hist Average\",\"21D\",T3,,,\"ORIGINAL CURRENCY\",\"THOUSANDS\",\"false\",\"false\",,{\"std.tec.cals=7\"}),\"\")","v":""},null,"Participación en el índice",null,{"$f":"IFERROR(_xll.ECONOMATICA($G$6&\"<XBue>\",\"Index particip.\",,$T$3,,,,\"decimal\",\"false\",\"false\"),\"\")","v":""}]
[]
[null,"Situación Financiera (12m)",null,null,null,null,null,null,"Performance Relativa",null,null,null,null,null,null,null,null,null,"Índice:","MERVAL",null,"← Seleccionar"]
[null,"Indicadores de Mercado",{"$f":"IFERROR(IF(MONTH(F19)=12,DATE(YEAR(F19)-2,MONTH(F19)+1,0),DATE(YEAR(F19)-1,MONTH(F19)+1,0)),\"\")","v":"2019-06-30"},null,{"$f":"IFERROR(DATE(YEAR(F19),1,0),\"\")","v":"2019-12-31"},{"$f":"IFERROR(_xlfn.SINGLE(_xll.ECONOMATICA($G$6&\"<XBue>\",\"Fin Statm Date\",,CHOOSE(ROUNDUP(MONTH(G19)/3,0),\"<dez/\"&YEAR(G19)-1,\"<mar/\"&YEAR(G19),\"<jun/\"&YEAR(G19),\"<set/\"&YEAR(G19)))),_xlfn.SINGLE(IFERROR(_xll.ECONOMATICA(G6&\"<XBue>\",\"Fin Statm Date\"),\"\")))","v":"2020-06-30"},{"$f":"T3","v":"2020-09-03"}]
[null,"Precio / Utilidad",{"$f":"IFERROR(_xll.ECONOMATICA($G$6&\"<XBue>\",\"P/E\",,C$19,,,,,\"false\",\"false\"),\"\")","v":""},null,{"$f":"IFERROR(_xll.ECONOMATICA($G$6&\"<XBue>\",\"P/E\",,E$19,,,,,\"false\",\"false\"),\"\")","v":""},{"$f":"IFERROR(_xll.ECONOMATICA($G$6&\"<XBue>\",\"P/E\",,F$19,,,,,\"false\",\"false\"),\"\")","v":""},{"$f":"IFERROR(_xll.ECONOMATICA($G$6&\"<XBue>\",\"P/E\",,G$19,,,,,\"false\",\"false\"),\"\")","v":""}]
[null,"Precio / Valor Patrimonio",{"$f":"IFERROR(_xll.ECONOMATICA($G$6&\"<XBue>\",\"P/BV\",,C$19,,,,,\"false\",\"false\"),\"\")","v":""},null,{"$f":"IFERROR(_xll.ECONOMATICA($G$6&\"<XBue>\",\"P/BV\",,E$19,,,,,\"false\",\"false\"),\"\")","v":""},{"$f":"IFERROR(_xll.ECONOMATICA($G$6&\"<XBue>\",\"P/BV\",,F$19,,,,,\"false\",\"false\"),\"\")","v":""},{"$f":"IFERROR(_xll.ECONOMATICA($G$6&\"<XBue>\",\"P/BV\",,G$19,,,,,\"false\",\"false\"),\"\")","v":""}]
[null,"Dividend Yield",{"$f":"IFERROR(_xll.ECONOMATICA($G$6&\"<XBue>\",\"Div Yld (end)\",,C$19,,,,\"decimal\",\"false\",\"false\"),\"\")","v":""},null,{"$f":"IFERROR(_xll.ECONOMATICA($G$6&\"<XBue>\",\"Div Yld (end)\",,E$19,,,,\"decimal\",\"false\",\"false\"),\"\")","v":""},{"$f":"IFERROR(_xll.ECONOMATICA($G$6&\"<XBue>\",\"Div Yld (end)\",,F$19,,,,\"decimal\",\"false\",\"false\"),\"\")","v":""},{"$f":"IFERROR(_xll.ECONOMATICA($G$6&\"<XBue>\",\"Div Yld (end)\",,G$19,,,,\"decimal\",\"false\",\"false\"),\"\")","v":""}]
[null,"Valor de Mercado",{"$f":"IFERROR(_xll.ECONOMATICA($G$6&\"<XBue>\",\"MarketCapitaliz\",,C$19,,,,,\"false\",\"false\"),\"\")","v":""},null,{"$f":"IFERROR(_xll.ECONOMATICA($G$6&\"<XBue>\",\"MarketCapitaliz\",,E$19,,,,,\"false\",\"false\"),\"\")","v":""},{"$f":"IFERROR(_xll.ECONOMATICA($G$6&\"<XBue>\",\"MarketCapitaliz\",,F$19,,,,,\"false\",\"false\"),\"\")","v":""},{"$f":"IFERROR(_xll.ECONOMATICA($G$6&\"<XBue>\",\"MarketCapitaliz\",,G$19,,,,,\"false\",\"false\"),\"\")","v":""}]
[null,"Price Sales Ratio",{"$f":"IFERROR(_xll.ECONOMATICA($G$6&\"<XBue>\",\"PSR\",,C$19,,,,,\"false\",\"false\"),\"\")","v":""},null,{"$f":"IFERROR(_xll.ECONOMATICA($G$6&\"<XBue>\",\"PSR\",,E$19,,,,,\"false\",\"false\"),\"\")","v":""},{"$f":"IFERROR(_xll.ECONOMATICA($G$6&\"<XBue>\",\"PSR\",,F$19,,,,,\"false\",\"false\"),\"\")","v":""},{"$f":"IFERROR(_xll.ECONOMATICA($G$6&\"<XBue>\",\"PSR\",,G$19,,,,,\"false\",\"false\"),\"\")","v":""}]
[null,"Dividendo Pago x acción",{"$f":"IFERROR(_xll.ECONOMATICA($G$6&\"<XBue>\",\"Divid per Share\",,C$19,,,,,\"false\",\"false\"),\"\")","v":""},null,{"$f":"IFERROR(_xll.ECONOMATICA($G$6&\"<XBue>\",\"Divid per Share\",,E$19,,,,,\"false\",\"false\"),\"\")","v":""},{"$f":"IFERROR(_xll.ECONOMATICA($G$6&\"<XBue>\",\"Divid per Share\",,F$19,,,,,\"false\",\"false\"),\"\")","v":""},{"$f":"IFERROR(_xll.ECONOMATICA($G$6&\"<XBue>\",\"Divid per Share\",,G$19,,,,,\"false\",\"false\"),\"\")","v":""}]
[]
[null,"Indicadores Financieros",{"$f":"IFERROR(IF(MONTH(F27)=12,DATE(YEAR(F27)-2,MONTH(F27)+1,0),DATE(YEAR(F27)-1,MONTH(F27)+1,0)),\"\")","v":"2019-06-30"},null,{"$f":"IFERROR(DATE(YEAR(F27),1,0),\"\")","v":"2019-12-31"},{"$f":"IFERROR(_xll.ECONOMATICA($G$6&\"<XBue>\",\"Fin Statm Date\",,CHOOSE(ROUNDUP(MONTH(G19)/3,0),\"<dez/\"&YEAR(G19)-1,\"<mar/\"&YEAR(G19),\"<jun/\"&YEAR(G19),\"<set/\"&YEAR(G19))),IFERROR(_xll.ECONOMATICA(G6&\"<XBue>\",\"Fin Statm Date\"),\"\"))","v":"2020-06-30"}]
[null,"UPA Utilidad por Acción",{"$f":"IFERROR(_xll.ECONOMATICA($G$6&\"<XBue>\",\"EPS\",\"12M\",C$27,,,,,\"false\",\"false\"),\"\")","v":""},null,{"$f":"IFERROR(_xll.ECONOMATICA($G$6&\"<XBue>\",\"EPS\",,E$27,,,,,\"false\",\"false\"),\"\")","v":""},{"$f":"IFERROR(_xll.ECONOMATICA($G$6&\"<XBue>\",\"EPS\",\"12M\",F$27,,,,,\"false\",\"false\"),\"\")","v":""},null,null,{"$f":"\"Precio / Utilidad en \"&T8","v":"Precio / Utilidad en 1Y"}]
[null,"VLA Valor libro x Acción",{"$f":"IFERROR(_xll.ECONOMATICA($G$6&\"<XBue>\",\"BVperShare\",,C$27,,,,,\"false\",\"false\"),\"\")","v":""},null,{"$f":"IFERROR(_xll.ECONOMATICA($G$6&\"<XBue>\",\"BVperShare\",,E$27,,,,,\"false\",\"false\"),\"\")","v":""},{"$f":"IFERROR(_xll.ECONOMATICA($G$6&\"<XBue>\",\"BVperShare\",,F$27,,,,,\"false\",\"false\"),\"\")","v":""}]
[null,"Margen Bruto",{"$f":"IFERROR(_xll.ECONOMATICA($G$6&\"<XBue>\",\"GrossMargin\",\"12M\",C$27,,,,\"decimal\",\"false\",\"false\"),\"\")","v":""},null,{"$f":"IFERROR(_xll.ECONOMATICA($G$6&\"<XBue>\",\"GrossMargin\",,E$27,,,,\"decimal\",\"false\",\"false\"),\"\")","v":""},{"$f":"IFERROR(_xll.ECONOMATICA($G$6&\"<XBue>\",\"GrossMargin\",\"12M\",F$27,,,,\"decimal\",\"false\",\"false\"),\"\")","v":""}]
[null,"ROE Rent Pat (pat final)",{"$f":"IFERROR(_xll.ECONOMATICA($G$6&\"<XBue>\",\"ROE (end)\",\"12M\",C$27,,,,\"decimal\",\"false\",\"false\"),\"\")","v":""},null,{"$f":"IFERROR(_xll.ECONOMATICA($G$6&\"<XBue>\",\"ROE (end)\",,E$27,,,,\"decimal\",\"false\",\"false\"),\"\")","v":""},{"$f":"IFERROR(_xll.ECONOMATICA($G$6&\"<XBue>\",\"ROE (end)\",\"12M\",F$27,,,,\"decimal\",\"false\",\"false\"),\"\")","v":""}]
[null,"Margen Neto",{"$f":"IFERROR(_xll.ECONOMATICA($G$6&\"<XBue>\",\"Net Margin\",\"12M\",C$27,,,,\"decimal\",\"false\",\"false\"),\"\")","v":""},null,{"$f":"IFERROR(_xll.ECONOMATICA($G$6&\"<XBue>\",\"Net Margin\",,E$27,,,,\"decimal\",\"false\",\"false\"),\"\")","v":""},{"$f":"IFERROR(_xll.ECONOMATICA($G$6&\"<XBue>\",\"Net Margin\",\"12M\",F$27,,,,\"decimal\",\"false\",\"false\"),\"\")","v":""}]
[null,"Deuda Bruta / PN",{"$f":"IFERROR(_xll.ECONOMATICA($G$6&\"<XBue>\",\"DebtGr/StkEq\",,C$27,,,,\"Decimal\",\"false\",\"false\"),\"\")","v":""},null,{"$f":"IFERROR(_xll.ECONOMATICA($G$6&\"<XBue>\",\"DebtGr/StkEq\",,E$27,,,,\"Decimal\",\"false\",\"false\"),\"\")","v":""},{"$f":"IFERROR(_xll.ECONOMATICA($G$6&\"<XBue>\",\"DebtGr/StkEq\",,F$27,,,,\"Decimal\",\"false\",\"false\"),\"\")","v":""}]
[null,"Liquidez Corriente",{"$f":"IFERROR(_xll.ECONOMATICA($G$6&\"<XBue>\",\"CurrRatio\",,C$27,,,,,\"false\",\"false\"),\"\")","v":""},null,{"$f":"IFERROR(_xll.ECONOMATICA($G$6&\"<XBue>\",\"CurrRatio\",,E$27,,,,,\"false\",\"false\"),\"\")","v":""},{"$f":"IFERROR(_xll.ECONOMATICA($G$6&\"<XBue>\",\"CurrRatio\",,F$27,,,,,\"false\",\"false\"),\"\")","v":""}]
[]
[null,"Balance",{"$f":"IFERROR(IF(MONTH(F36)=12,DATE(YEAR(F36)-2,MONTH(F36)+1,0),DATE(YEAR(F36)-1,MONTH(F36)+1,0)),\"\")","v":"2019-06-30"},null,{"$f":"IFERROR(DATE(YEAR(F36),1,0),\"\")","v":"2019-12-31"},{"$f":"IFERROR(_xlfn.SINGLE(_xll.ECONOMATICA($G$6&\"<XBue>\",\"Fin Statm Date\",,CHOOSE(ROUNDUP(MONTH(G19)/3,0),\"<dez/\"&YEAR(G19)-1,\"<mar/\"&YEAR(G19),\"<jun/\"&YEAR(G19),\"<set/\"&YEAR(G19)))),_xlfn.SINGLE(IFERROR(_xll.ECONOMATICA(G6&\"<XBue>\",\"Fin Statm Date\"),\"\")))","v":"2020-06-30"},{"$f":"IFERROR(_xlfn.SINGLE(_xll.ECONOMATICA($G$6&\"<XBue>\",\"Fin Statm Date\",,CHOOSE(ROUNDUP(MONTH(G19)/3,0),\"<dez/\"&YEAR(G19)-1,\"<mar/\"&YEAR(G19),\"<jun/\"&YEAR(G19),\"<set/\"&YEAR(G19)))),_xlfn.SINGLE(IFERROR(_xll.ECONOMATICA(G6&\"<XBue>\",\"Fin Statm Date\"),\"\")))","v":"2020-06-30"}]
[null,"Activo total",{"$f":"IFERROR(_xll.ECONOMATICA($G$6&\"<XBue>\",\"Total Assets\",,C$36,,,,,\"false\",\"false\"),\"\")","v":""},null,{"$f":"IFERROR(_xll.ECONOMATICA($G$6&\"<XBue>\",\"Total Assets\",,E$36,,,,,\"false\",\"false\"),\"\")","v":""},{"$f":"IFERROR(_xll.ECONOMATICA($G$6&\"<XBue>\",\"Total Assets\",,F$36,,,,,\"false\",\"false\"),\"\")","v":""},{"$f":"IFERROR(_xll.ECONOMATICA($G$6&\"<XBue>\",\"Total Assets\",,G$36,,,\"usd\",,\"false\",\"false\"),\"\")","v":""}]
[null,"Patrimônio Neto",{"$f":"IFERROR(_xll.ECONOMATICA($G$6&\"<XBue>\",\"Stock Eq Par\",,C$36,,,,,\"false\",\"false\"),\"\")","v":""},null,{"$f":"IFERROR(_xll.ECONOMATICA($G$6&\"<XBue>\",\"Stock Eq Par\",,E$36,,,,,\"false\",\"false\"),\"\")","v":""},{"$f":"IFERROR(_xll.ECONOMATICA($G$6&\"<XBue>\",\"Stock Eq Par\",,F$36,,,,,\"false\",\"false\"),\"\")","v":""},{"$f":"IFERROR(_xll.ECONOMATICA($G$6&\"<XBue>\",\"Stock Eq Par\",,G$36,,,\"usd\",,\"false\",\"false\"),\"\")","v":""},null,"Ganancia Neta - Trimestral en USD",null,null,null,null,null,null,null,null,null,"Período:","10Y"]
[null,"Ingresos Netos",{"$f":"IFERROR(_xll.ECONOMATICA($G$6&\"<XBue>\",\"Revenues\",,C$36,,,,,\"false\",\"false\"),\"\")","v":""},null,{"$f":"IFERROR(_xll.ECONOMATICA($G$6&\"<XBue>\",\"Revenues\",,E$36,,,,,\"false\",\"false\"),\"\")","v":""},{"$f":"IFERROR(_xll.ECONOMATICA($G$6&\"<XBue>\",\"Revenues\",,F$36,,,,,\"false\",\"false\"),\"\")","v":""},{"$f":"IFERROR(_xll.ECONOMATICA($G$6&\"<XBue>\",\"Revenues\",,G$36,,,\"usd\",,\"false\",\"false\"),\"\")","v":""}]
[null,"EBIT",{"$f":"IFERROR(_xll.ECONOMATICA($G$6&\"<XBue>\",\"EBIT\",,C$36,,,,,\"false\",\"false\"),\"\")","v":""},null,{"$f":"IFERROR(_xll.ECONOMATICA($G$6&\"<XBue>\",\"EBIT\",,E$36,,,,,\"false\",\"false\"),\"\")","v":""},{"$f":"IFERROR(_xll.ECONOMATICA($G$6&\"<XBue>\",\"EBIT\",,F$36,,,,,\"false\",\"false\"),\"\")","v":""},{"$f":"IFERROR(_xll.ECONOMATICA($G$6&\"<XBue>\",\"EBIT\",,G$36,,,\"usd\",,\"false\",\"false\"),\"\")","v":""}]
{"$rows_left_out":8}
{"sheet":"Base_Gráficos","index":1,"n_rows":272,"n_cols":10,"rows_kept":272,"cut":false,"hidden":false,"merged":[]}
["Planilla Auxiliar - NO MODIFICAR"]
["Activo:",{"$f":"'Planilla Acciones Básica'!G6&\"<XBUE>\"","v":"BBAR<XBUE>"},"← No modificar"]
["Inicio de Serie",{"$f":"_xll.ECONOMATICA(B2,\"Series Start Date\")","v":{"$error":"#VALUE!"}},"← No modificar"]
["Fecha:",{"$f":"'Planilla Acciones Básica'!T3","v":"2020-09-03"},"← No modificar","Mínimo:",{"$f":"ROUNDDOWN(MIN(E$10:F$1048576),-1)","v":{"$error":"#VALUE!"}},"← No modificar"]
["Final:",{"$f":"IF('Planilla Acciones Básica'!T8=\"DESDE O INÍCIO\",B3,'Planilla Acciones Básica'!T8)","v":"1Y"},"← No modificar","Máximo:",{"$f":"ROUNDUP(MAX($E$10:$F$1048574),-1)","v":{"$error":"#VALUE!"}},"← No modificar",null,"Año Inicial:",{"$f":"IF('Planilla Acciones Básica'!T38=\"DESDE O INÍCIO\",B3,'Planilla Acciones Básica'!T38)","v":"10Y"},"← No modificar"]
["Intervalo:",{"$f":"'Planilla Acciones Básica'!Q8","v":"D"},"← No modificar","VBA Gráfico:",{"$f":"AtualizarLimitesGrafico(\"Planilla Acciones Básica\",\"Base100\",E4,E5)","v":{"$error":"#VALUE!"}},"← No modificar"]
[]
["Gráfico de Precio de Acción",null,null,null,"Gráfico de Performance Relativa",null,"Gráfico Precio/Utilidad","Gráfico Ganancia Neta"]
["Fecha","Máximo","Mínimo","Cierre",{"$f":"'Planilla Acciones Básica'!G6","v":"BBAR"},{"$f":"'Planilla Acciones Básica'!T18","v":"MERVAL"},"P/L","Fecha","Ganancia Neta"]
[{"$f":"_xll.ECONOMATICA($B$2,\"high\",,$B$4,$B$5,$B$6,,,\"true\",\"false\",,)","v":{"$error":"#VALUE!"}},98.949999999953405,{"$f":"_xll.ECONOMATICA($B$2,\"Low\",,$B$4,$B$5,$B$6,,,\"FALSE\",\"false\")","v":{"$error":"#VALUE!"}},{"$f":"_xll.ECONOMATICA($B$2,\"close\",,$B$4,$B$5,$B$6,,,\"FALSE\",\"false\")","v":{"$error":"#VALUE!"}},{"$f":"_xll.ECONOMATICA($B$2,\"close\",,$B$4,$B$5,$B$6,,,\"false\",\"false\",,{\"def.defdef=7\"})","v":{"$error":"#VALUE!"}},{"$f":"_xll.ECONOMATICA($F$9,\"close\",,$B$4,$B$5,$B$6,,,\"FALSE\",\"false\",,{\"def.defdef=7\"})","v":{"$error":"#VALUE!"}},{"$f":"_xll.ECONOMATICA(B2,\"P/E\",\"12M\",$B$4,$B$5,$B$6,,,\"false\",\"false\")","v":{"$error":"#VALUE!"}},{"$f":"_xll.ECONOMATICA($B$2,\"Net Income\",\"3M\",B4,I5,\"Q\",\"uSd\",,\"true\",\"false\")","v":{"$error":"#VALUE!"}},106766662.151733]
["2019-09-04",88.25,81.550000000046595,85.300000000046595,105.896958410856,106.645628557075,2.7737583302077802,"2010-12-31",92804036.730224594]
["2019-09-05",91.800000000046595,88,90.800000000046595,112.725015518256,116.10880243103,2.9526055847927601,"2011-03-31",45523392.561889596]
["2019-09-06",96,93,95.300000000046595,118.31160769704699,119.703069682932,3.0989351567295702,"2011-06-30",44688432.939208999]
["2019-09-09",100,90.5,93.099999999976703,115.580384853994,117.801905010594,3.0273962548926598,"2011-09-30",21476123.163421601]
["2019-09-10",98,92.5,97.900000000023297,121.53941651142701,122.99637068843001,3.1834811316220999,"2011-12-31",98523258.759521499]
["2019-09-11",100,95,97.75,121.35319677204799,123.790117850062,3.1786034792239701,"2012-03-31",45178729.079345703]
["2019-09-12",101,96,99.75,123.83612662926301,125.77135293942401,3.2436388445276001,"2012-06-30",49173705.185424797]
["2019-09-13",105,100,104.75,130.043451272417,130.039412966697,3.4062272577866701,"2012-09-30",64970059.260009803]
["2019-09-16",108.5,102.05000000004701,103.44999999995299,128.42954686516899,132.57306047459099,3.3639542703385801,"2012-12-31",35018562.055053703]
["2019-09-17",104.5,98.349999999976703,103.849999999977,128.926132836612,130.28286506049301,3.3769613433978498,"2013-03-31",40704925.012939498]
["2019-09-18",105,98.599999999976703,101.150000000023,125.57417752943,130.15163254225601,3.2891636002423201,"2013-06-30",31115065.295257598]
["2019-09-19",102,98.099999999976703,100,124.146492861444,131.606252320111,3.2517682651887299,"2013-09-30",60343308.903381303]
["2019-09-20",103.69999999995299,96.800000000046595,97.349999999976703,120.856610800605,130.05146890110299,3.1655964061610602,"2013-12-31",91441941.677123994]
["2019-09-23",98.449999999953405,91,95.900000000023297,119.05648665421199,125.96960608218799,3.1184457663184699,"2014-03-31",138321198.273682]
["2019-09-24",96,89.800000000046595,90.650000000023297,112.538795778994,120.20202980458301,2.9477279323946299,"2014-06-30",32590424.760192901]
["2019-09-25",92.599999999976703,88.5,91.800000000046595,113.966480446863,121.813765630126,2.98512326744458,"2014-09-30",36986256.841491699]
["2019-09-26",95.800000000046595,90.099999999976703,90.900000000023297,112.849162011058,121.528528272873,2.9558573530593999,"2014-12-31",62787220.661926299]
["2019-09-27",95.199999999953405,91.5,94.849999999976703,117.75294847902801,124.428434202098,3.0843021995315199,"2015-03-31",77575601.016723603]
["2019-09-30",94.449999999953405,90.199999999953405,93.150000000023297,115.64245810045399,125.601921690162,2.15242555260193,"2015-06-30",48414972.707397498]
["2019-10-01",97,93,95.599999999976703,118.684047175571,129.91945858066899,2.20903792623358,"2015-09-30",66671924.654235803]
["2019-10-02",97.5,95.050000000046595,97,120.422098075622,133.056248495821,2.2413878540210099,"2015-12-31",73622079.777710006]
["2019-10-03",97,93,95.199999999953405,118.187461204012,131.21480174921501,2.19979508972028,"2016-03-31",80126267.141723603]
["2019-10-04",101.94999999995299,95.400000000023297,101.150000000023,125.57417752943,137.48302338644899,2.3372822828277999,"2016-06-30",57419330.579589799]
["2019-10-07",104,97.650000000023297,97.800000000046595,121.415270018624,133.699318083702,2.2598735270476,"2016-09-30",56788150.096679702]
["2019-10-08",100.150000000023,94.650000000023297,96.599999999976703,119.92551210417901,130.74535490036899,2.23214501751136,"2016-12-31",31758762.765625]
["2019-10-09",98.099999999976703,95,97.550000000046595,121.104903786443,131.09497699653701,2.2540967542263401,"2017-03-31",103336782.342041]
["2019-10-10",103.349999999977,97,103,127.870887647267,137.166285039391,2.3800304016949698,"2017-06-30",-22215374.224182099]
["2019-10-11",105,100.94999999995299,102.099999999977,126.753569211578,137.403557926649,2.3592340195427801,"2017-09-30",61715529.954650901]
["2019-10-14",null,null,null,null,null,2.3592340195427801,"2017-12-31",67596541.103515595]
["2019-10-15",101,97.5,100.5,124.767225325806,135.39669857546701,2.3222626734968799,"2018-03-31",76610389.172241196]
{"$rows_left_out":233}
{"sheet":"Base","index":2,"n_rows":151,"n_cols":7,"rows_kept":151,"cut":false,"hidden":false,"merged":[]}
["↓ Lista de Códigos (es posible modificar la lista)"]
[{"$f":"_xll.ECOSECURITIES(\"stock\",\"active\",\"true\",\"arg\",\"xbue\")","v":"Codigo"},{"$f":"_xll.ECONOMATICA($A$3:$A$200,\"TICKER\")","v":"Codigo"},{"$f":"_xll.ECONOMATICA($A$3:$A$200,\"NAME\")","v":"Nombre"},{"$f":"_xll.ECONOMATICA($A$3:$A$200,\"CLASS\")","v":"Clase"},"Nombre y Clase",null,"Funciones Utilizadas"]
["AGRO<XBUE>","AGRO","Agrometal","Ord",{"$f":"CONCATENATE(C3,\" \",D3)","v":"Agrometal Ord"},null,{"$f":"_xlfn.FORMULATEXT('Planilla Acciones Básica'!K5)","v":"=FIN.MES(L5;-1)"}]
["ALUA<XBUE>","ALUA","Aluar","Ord",{"$f":"CONCATENATE(C4,\" \",D4)","v":"Aluar Ord"},null,{"$f":"_xlfn.FORMULATEXT('Planilla Acciones Básica'!N5)","v":"=FECHA(AÑO($T$3)-2;12;31)"}]
["AUSO<XBUE>","AUSO","Autopistas del Sol","Ord D","Autopistas del Sol Ord D",null,{"$f":"_xlfn.FORMULATEXT('Planilla Acciones Básica'!F19)","v":"=SI.ERROR(@ECONOMATICA($G$6&\"<XBue>\";\"Fin Statm Date\";;ELEGIR(REDONDEAR.MAS(MES(G19)/3;0);\"<dez/\"&AÑO(G19)-1;\"<mar/\"&AÑO(G19);\"<jun/\"&AÑO(G19);\"<set/\"&AÑO(G19)));@SI.ERROR(ECONOMATICA(G6&\"<XBue>\";\"Fin Statm Date\");\"\"))"}]
["BHIP<XBUE>","BHIP","Banco Hipotecario","Ord","Banco Hipotecario Ord",null,{"$f":"_xlfn.FORMULATEXT('Planilla Acciones Básica'!C19)","v":"=SI.ERROR(SI(MES(F19)=12;FECHA(AÑO(F19)-2;MES(F19)+1;0);FECHA(AÑO(F19)-1;MES(F19)+1;0));\"\")"}]
["BMA<XBUE>","BMA","Banco Macro S.A.","Ord B","Banco Macro S.A. Ord B",null,{"$f":"_xlfn.FORMULATEXT('Planilla Acciones Básica'!E19)","v":"=SI.ERROR(FECHA(AÑO(F19);1;0);\"\")"}]
["BPAT<XBUE>","BPAT","Banco Patagonia","Ord","Banco Patagonia Ord"]
["BRIO<XBUE>","BRIO","Banco Santander Rio","Ord B","Banco Santander Rio Ord B"]
["BBAR<XBUE>","BBAR","Bbva S. A.","Ord","Bbva S. A. Ord"]
["GAMI<XBUE>","GAMI","B-Gaming Sa","Ord","B-Gaming Sa Ord"]
["ESME<XBUE>","ESME","Bodegas Esmeralda","Ord","Bodegas Esmeralda Ord"]
["BOLT<XBUE>","BOLT","Boldt","Ord","Boldt Ord"]
["BYMA<XBUE>","BYMA","Bolsas Y Mercados Argentinos S.A.","Ord A","Bolsas Y Mercados Argentinos S.A. Ord A"]
["CVH<XBUE>","CVH","Cablevisión Holding S.A.","Ord B","Cablevisión Holding S.A. Ord B"]
["CGPA2<XBUE>","CGPA2","Camuzzi Gas Pamp.","Ord B","Camuzzi Gas Pamp. Ord B"]
["CAPX<XBUE>","CAPX","Capex","Ord A","Capex Ord A"]
["CARC<XBUE>","CARC","Carboclor S.A.","Ord","Carboclor S.A. Ord"]
["CADO<XBUE>","CADO","Carlos Casado","Ord","Carlos Casado Ord"]
["CELU<XBUE>","CELU","Celulosa","Ord","Celulosa Ord"]
["CEPU<XBUE>","CEPU","Central Puerto","Ord","Central Puerto Ord"]
["COME<XBUE>","COME","Comercial del Plata","Ord","Comercial del Plata Ord"]
["CTIO<XBUE>","CTIO","Consultatio","Ord","Consultatio Ord"]
["CRES<XBUE>","CRES","Cresud","Ord","Cresud Ord"]
["DGCU2<XBUE>","DGCU2","Distr Gas Cuyana","Ord B","Distr Gas Cuyana Ord B"]
["DOME<XBUE>","DOME","Domec","Ord","Domec Ord"]
["DYCA<XBUE>","DYCA","Dycasa","Ord B","Dycasa Ord B"]
["EDN<XBUE>","EDN","Edenor","Ord B","Edenor Ord B"]
["EDSH<XBUE>","EDSH","Edesa Holding S.A.","Ord","Edesa Holding S.A. Ord"]
["EDLH<XBUE>","EDLH","Edesal Holding S.A.","Ord","Edesal Holding S.A. Ord"]
["EMDE<XBUE>","EMDE","Emdersa","Ord","Emdersa Ord"]
["CECO2<XBUE>","CECO2","Enel Generacion Costanera S.A.","Ord","Enel Generacion Costanera S.A. Ord"]
["FERR<XBUE>","FERR","Ferrum","Ord","Ferrum Ord"]
["FIPL<XBUE>","FIPL","Fiplasto","Ord","Fiplasto Ord"]
["GARO<XBUE>","GARO","Garovaglio","Ord","Garovaglio Ord"]
["GBAN<XBUE>","GBAN","Gas Natural Ban","Ord B","Gas Natural Ban Ord B"]
["GRIM<XBUE>","GRIM","Grimoldi","Ord B","Grimoldi Ord B"]
["GCLA<XBUE>","GCLA","Grupo Clarin","Ord B","Grupo Clarin Ord B"]
["OEST<XBUE>","OEST","Grupo Concesionario del Oeste S.A.","Ord B","Grupo Concesionario del Oeste S.A. Ord B"]
["GGAL<XBUE>","GGAL","Grupo Fin. Galicia","Ord B","Grupo Fin. Galicia Ord B"]
{"$rows_left_out":111}