{"text_format":"1","workbook":"xlsx","n_sheets":3,"sheets":["Lâmina_Ações Básica","Base_Gráficos","Base"],"not_rendered":{"charts":4,"images":1,"macros":1,"external_links":0,"defined_names":26,"comments":0,"pivot_tables":0},"unopened":[],"bounds":{"document_bytes":16777216,"sheet_cells":100000,"rows_first":2000,"rows_last":500,"rows_between":2000,"halvings":0,"cell_chars":16384,"cell_head_chars":4096},"cells_cut":0,"cells_raw":0,"read":"whole","date_system":"1900"}

{"sheet":"Lâmina_Ações Básica","index":0,"n_rows":49,"n_cols":20,"rows_kept":49,"cut":false,"hidden":false,"merged":[[4,8,4,19],[4,1,4,6],[11,1,11,2],[11,4,11,6],[18,1,18,6],[29,8,29,19]]}
[null,null,null,null,"Lâmina - Ações Básica"]
[null,"Dta. Últ. Cot.:",{"$f":"IF($C$3=\"\",_xll.ECONOMATICA(\"IBOV\",\"Date of Last Quote\"),$C$3)","v":"2024-09-26"},null,"← Não Modificar"]
[null,"Dta. Pref. Últ. Cot.:",null,null,"← Para alterar a data da Célula C5, basta digitar na Célula C6"]
[]
[null,"Informações Gerais",null,null,null,null,null,null,"Retorno"]
[null,"Nome",null,null,null,{"$f":"IFERROR(INDEX(Base!F:F,MATCH('Lâmina_Ações Básica'!F7,Base!C:C,0)),\"\")","v":"Petrobras PN"},null,null,"Código","Tipo",{"$f":"EOMONTH(L6,-1)","v":"2024-07-31"},{"$f":"EOMONTH(M6,-1)","v":"2024-08-31"},{"$f":"C2","v":"2024-09-26"},{"$f":"DATE(YEAR($C$2)-2,12,31)","v":"2022-12-31"},{"$f":"DATE(YEAR($C$2)-1,12,31)","v":"2023-12-31"},{"$f":"C2","v":"2024-09-26"},"1d","1w","1m","12m"]
[null,"Código",null,null,"Digitar ou Selecionar o Códigol →","PETR4",null,null,{"$f":"IFERROR(_xll.ECONOMATICA(F7&\"<XBSP>\",\"ticker\"),\"\")","v":"PETR4"},{"$f":"IFERROR(_xll.ECONOMATICA(F7&\"<XBSP>\",\"Class\"),\"\")","v":"PN"},{"$f":"IFERROR(_xll.ECONOMATICA($F$7&\"<XBSP>\",\"return\",\"in the month\",K6,,,,\"decimal\"),\"\")","v":-1.6819973719E-2},{"$f":"IFERROR(_xll.ECONOMATICA($F$7&\"<XBSP>\",\"return\",\"in the month\",L6,,,,\"decimal\"),\"\")","v":8.2343116655999998E-2},{"$f":"IFERROR(_xll.ECONOMATICA($F$7&\"<XBSP>\",\"return\",\"in the month\",M6,,,,\"decimal\"),\"\")","v":-7.9248158496000004E-2},{"$f":"IFERROR(_xll.ECONOMATICA($F$7&\"<XBSP>\",\"return\",\"in the year\",N6,,,,\"decimal\"),\"\")","v":0.47226626734999999},{"$f":"IFERROR(_xll.ECONOMATICA($F$7&\"<XBSP>\",\"return\",\"in the year\",O6,,,,\"decimal\"),\"\")","v":0.96039670944},{"$f":"IFERROR(_xll.ECONOMATICA($F$7&\"<XBSP>\",\"return\",\"in the year\",P6,,,,\"decimal\"),\"\")","v":0.10499992656},{"$f":"IFERROR(_xll.ECONOMATICA($F$7&\"<XBSP>\",\"return\",Q6,C2,,,,\"decimal\"),\"\")","v":-2.1592442645000001E-2},{"$f":"IFERROR(_xll.ECONOMATICA($F$7&\"<XBSP>\",\"return\",R6,$C$2,,,,\"decimal\"),\"\")","v":-5.5141990651000003E-4},{"$f":"IFERROR(_xll.ECONOMATICA($F$7&\"<XBSP>\",\"return\",S6,$C$2,,,,\"decimal\",\"false\",\"false\"),\"\")","v":-8.3901945919000007E-2},{"$f":"IFERROR(_xll.ECONOMATICA($F$7&\"<XBSP>\",\"return\",T6,$C$2,,,,\"decimal\",\"false\",\"false\"),\"\")","v":0.27689750965999999}]
[null,"Subsetor Bovespa",null,null,null,{"$f":"IFERROR(_xll.ECONOMATICA($F$7&\"<XBSP>\",\"Subsector Bovespa\",,$C$2),\"\")","v":""}]
[null,"Principal Acionista",null,null,null,{"$f":"IFERROR(_xll.ECONOMATICA($F$7&\"<XBSP>\",\"MainShHol\"),\"\")","v":"Uniao Federal (Tesouro Nacional)"},null,null,"Preço da Ação",null,null,null,null,null,null,"Selecione os Meses ou Digite uma Data e Selecionar um Período (M = Mês; Q = Trimestre; Y = Anos) →","Período: ","D","Anos: ","1Y"]
[null,"Ações Possuídas (Principal Acionista)",null,null,null,{"$f":"IFERROR(_xll.ECONOMATICA($F$7&\"<XBSP>\",\"ShrsHold\",,,,,,\"decimal\",\"false\",,,{\"std.cac.ccacq=2\";\"std.cac.fam=1\"}),\"\")","v":0.28674703448}]
[]
[null,"Cotações",null,null,"Estatísticas"]
[null,"Fechamento",{"$f":"IFERROR(_xll.ECONOMATICA($F$7&\"<XBSP>\",\"Close\",,$C$2,,,,,\"false\",\"false\"),\"\")","v":36.25},null,"Beta (60 meses)",null,{"$f":"IFERROR(_xll.ECONOMATICA($F$7&\"<XBSP>\",\"Beta\",,$C$2,,,,,\"false\",\"false\"),\"\")","v":1.3511742135}]
[null,"Data da Última Cotação",{"$f":"IFERROR(_xll.ECONOMATICA($F$7&\"<XBSP>\",\"Date of Last Quote\",,$C$2,,,\"ORIGINAL CURRENCY\",,\"false\",\"false\"),\"\")","v":"2024-09-26"},null,"Correlação (60 meses)",null,{"$f":"IFERROR(_xll.ECONOMATICA($F$7&\"<XBSP>\",\"Correlation\",,C2,,,,,\"false\",\"false\"),\"\")","v":0.77320545887000003}]
[null,"Máximo (52w)",{"$f":"IFERROR(_xll.ECONOMATICA($F$7&\"<XBSP>\",\"High\",\"52w\",$C$2,,,,,\"false\",\"false\"),\"\")","v":39.86},null,"Volatilidade (1 ano)",null,{"$f":"IFERROR(_xll.ECONOMATICA($F$7&\"<XBSP>\",\"Volatility\",\"1y\",C2,,,,,\"false\",\"false\"),\"\")","v":28.092918208}]
[null,"Mínimo (52w)",{"$f":"IFERROR(_xll.ECONOMATICA($F$7&\"<XBSP>\",\"Low\",\"52w\",$C$2,,,,,\"false\",\"FALSE\"),\"\")","v":27.396436642000001},null,"Sharpe (1 ano)",null,{"$f":"IFERROR(_xll.ECONOMATICA($F$7&\"<XBSP>\",\"Sharpe\",\"1y\",C2,,,,,\"false\",\"false\"),\"\")","v":0.70521181053000004}]
[null,"Volume Médio (Milhões)",{"$f":"IFERROR(_xll.ECONOMATICA($F$7&\"<XBSP>\",\"Hist Average\",\"21D\",C2,,,\"ORIGINAL CURRENCY\",\"THOUSANDS\",\"false\",\"false\",,{\"std.tec.cals=7\"}),\"\")","v":1290892.8032},null,"Participação no Índice",null,{"$f":"IFERROR(_xll.ECONOMATICA($F$7&\"<XBSP>\",\"Index particip.\",,$C$2,,,,\"decimal\",\"false\",\"false\"),\"\")","v":""}]
[]
[null,"Situação Financeira (12m)",null,null,null,null,null,null,"Performance Relativa",null,null,null,null,null,null,null,null,"Selecione Um Índice →","Índice: ","IBOV"]
[]
[null,"Indicador de Mercado",{"$f":"IFERROR(IF(MONTH(F21)=12,DATE(YEAR(F21)-2,MONTH(F21)+1,0),DATE(YEAR(F21)-1,MONTH(F21)+1,0)),\"\")","v":"2023-06-30"},null,{"$f":"IFERROR(DATE(YEAR(F21),1,0),\"\")","v":"2023-12-31"},{"$f":"IFERROR(_xll.ECONOMATICA($F$7&\"<XBSP>\",\"Fin Statm Date\",,CHOOSE(ROUNDUP(MONTH(G21)/3,0),\"<dez/\"&YEAR(G21)-1,\"<mar/\"&YEAR(G21),\"<jun/\"&YEAR(G21),\"<set/\"&YEAR(G21))),IFERROR(_xll.ECONOMATICA(F7&\"<XBSP>\",\"Fin Statm Date\"),\"\"))","v":"2024-06-30"},{"$f":"C2","v":"2024-09-26"}]
[null,"Preco / Lucro",{"$f":"IFERROR(_xll.ECONOMATICA($F$7&\"<XBSP>\",\"P/E\",,C$21,,,,,\"false\",\"false\"),\"\")","v":2.4632790615000002},null,{"$f":"IFERROR(_xll.ECONOMATICA($F$7&\"<XBSP>\",\"P/E\",,E$21,,,,,\"false\",\"false\"),\"\")","v":3.8961663912},{"$f":"IFERROR(_xll.ECONOMATICA($F$7&\"<XBSP>\",\"P/E\",,F$21,,,,,\"false\",\"false\"),\"\")","v":6.2691873213999996},{"$f":"IFERROR(_xll.ECONOMATICA($F$7&\"<XBSP>\",\"P/E\",,G$21,,,,,\"false\",\"false\"),\"\")","v":5.9726160421000003}]
[null,"Preco / Valor Patrimônio",{"$f":"IFERROR(_xll.ECONOMATICA($F$7&\"<XBSP>\",\"P/BV\",,C$21,,,,,\"false\",\"false\"),\"\")","v":1.0391500642},null,{"$f":"IFERROR(_xll.ECONOMATICA($F$7&\"<XBSP>\",\"P/BV\",,E$21,,,,,\"false\",\"false\"),\"\")","v":1.2666634553},{"$f":"IFERROR(_xll.ECONOMATICA($F$7&\"<XBSP>\",\"P/BV\",,F$21,,,,,\"false\",\"false\"),\"\")","v":1.3131026953},{"$f":"IFERROR(_xll.ECONOMATICA($F$7&\"<XBSP>\",\"P/BV\",,G$21,,,,,\"false\",\"false\"),\"\")","v":1.250984828}]
[null,"Dividend Yield (cot fim)",{"$f":"IFERROR(_xll.ECONOMATICA($F$7&\"<XBSP>\",\"Div Yld (end)\",,C$21,,,,\"decimal\",\"false\",\"false\"),\"\")","v":0.50233802608},null,{"$f":"IFERROR(_xll.ECONOMATICA($F$7&\"<XBSP>\",\"Div Yld (end)\",,E$21,,,,\"decimal\",\"false\",\"false\"),\"\")","v":0.19462380263000001},{"$f":"IFERROR(_xll.ECONOMATICA($F$7&\"<XBSP>\",\"Div Yld (end)\",,F$21,,,,\"decimal\",\"false\",\"false\"),\"\")","v":0.16988014954},{"$f":"IFERROR(_xll.ECONOMATICA($F$7&\"<XBSP>\",\"Div Yld (end)\",,G$21,,,,\"decimal\",\"false\",\"false\"),\"\")","v":0.17566443751999999}]
[null,"Valor de Mercado",{"$f":"IFERROR(_xll.ECONOMATICA($F$7&\"<XBSP>\",\"MarketCapitaliz\",,C$21,,,,,\"false\",\"false\"),\"\")","v":411764029270},null,{"$f":"IFERROR(_xll.ECONOMATICA($F$7&\"<XBSP>\",\"MarketCapitaliz\",,E$21,,,,,\"false\",\"false\"),\"\")","v":494840194200},{"$f":"IFERROR(_xll.ECONOMATICA($F$7&\"<XBSP>\",\"MarketCapitaliz\",,F$21,,,,,\"false\",\"false\"),\"\")","v":507756680680},{"$f":"IFERROR(_xll.ECONOMATICA($F$7&\"<XBSP>\",\"MarketCapitaliz\",,G$21,,,,,\"false\",\"false\"),\"\")","v":492743416230}]
[null,"Price Sales Ratio",{"$f":"IFERROR(_xll.ECONOMATICA($F$7&\"<XBSP>\",\"PSR\",,C$21,,,,,\"false\",\"false\"),\"\")","v":0.66234485899999995},null,{"$f":"IFERROR(_xll.ECONOMATICA($F$7&\"<XBSP>\",\"PSR\",,E$21,,,,,\"false\",\"false\"),\"\")","v":0.94822538807000001},{"$f":"IFERROR(_xll.ECONOMATICA($F$7&\"<XBSP>\",\"PSR\",,F$21,,,,,\"false\",\"false\"),\"\")","v":0.98941019906000005},{"$f":"IFERROR(_xll.ECONOMATICA($F$7&\"<XBSP>\",\"PSR\",,G$21,,,,,\"false\",\"false\"),\"\")","v":0.94260498596999998}]
[null,"Dividendo Pago por Ação",{"$f":"IFERROR(_xll.ECONOMATICA($F$7&\"<XBSP>\",\"Divid per Share\",,C$21,,,,,\"false\",\"false\"),\"\")","v":14.83404191},null,{"$f":"IFERROR(_xll.ECONOMATICA($F$7&\"<XBSP>\",\"Divid per Share\",,E$21,,,,,\"false\",\"false\"),\"\")","v":7.2477904100000003},{"$f":"IFERROR(_xll.ECONOMATICA($F$7&\"<XBSP>\",\"Divid per Share\",,F$21,,,,,\"false\",\"false\"),\"\")","v":6.4639396900000001},{"$f":"IFERROR(_xll.ECONOMATICA($F$7&\"<XBSP>\",\"Divid per Share\",,G$21,,,,,\"false\",\"false\"),\"\")","v":6.3678358599999996}]
[]
[null,"Indicador Financeiros",{"$f":"IFERROR(IF(MONTH(F29)=12,DATE(YEAR(F29)-2,MONTH(F29)+1,0),DATE(YEAR(F29)-1,MONTH(F29)+1,0)),\"\")","v":"2023-06-30"},null,{"$f":"IFERROR(DATE(YEAR(F29),1,0),\"\")","v":"2023-12-31"},{"$f":"IFERROR(_xll.ECONOMATICA($F$7&\"<XBSP>\",\"Fin Statm Date\",,CHOOSE(ROUNDUP(MONTH(G21)/3,0),\"<dez/\"&YEAR(G21)-1,\"<mar/\"&YEAR(G21),\"<jun/\"&YEAR(G21),\"<set/\"&YEAR(G21))),IFERROR(_xll.ECONOMATICA(F7&\"<XBSP>\",\"Fin Statm Date\"),\"\"))","v":"2024-06-30"}]
[null,"LPA Lucro por Ação",{"$f":"IFERROR(_xll.ECONOMATICA($F$7&\"<XBSP>\",\"EPS\",\"12M\",C$29,,,,,\"false\",\"false\"),\"\")","v":11.9880855},null,{"$f":"IFERROR(_xll.ECONOMATICA($F$7&\"<XBSP>\",\"EPS\",,E$29,,,,,\"false\",\"false\"),\"\")","v":9.5581133505999993},{"$f":"IFERROR(_xll.ECONOMATICA($F$7&\"<XBSP>\",\"EPS\",\"12M\",F$29,,,,,\"false\",\"false\"),\"\")","v":6.0693672160999999},null,null,{"$f":"\"Preço / Lucro em \"&T9","v":"Preço / Lucro em 1Y"}]
[null,"VPA Valor Patr por Ação",{"$f":"IFERROR(_xll.ECONOMATICA($F$7&\"<XBSP>\",\"BVperShare\",,C$29,,,,,\"false\",\"false\"),\"\")","v":28.41745482},null,{"$f":"IFERROR(_xll.ECONOMATICA($F$7&\"<XBSP>\",\"BVperShare\",,E$29,,,,,\"false\",\"false\"),\"\")","v":29.400074537999998},{"$f":"IFERROR(_xll.ECONOMATICA($F$7&\"<XBSP>\",\"BVperShare\",,F$29,,,,,\"false\",\"false\"),\"\")","v":28.977169976999999}]
[null,"Margem Bruta",{"$f":"IFERROR(_xll.ECONOMATICA($F$7&\"<XBSP>\",\"GrossMargin\",\"12M\",C$29,,,,\"decimal\",\"false\",\"false\"),\"\")","v":0.50633379358999997},null,{"$f":"IFERROR(_xll.ECONOMATICA($F$7&\"<XBSP>\",\"GrossMargin\",,E$29,,,,\"decimal\",\"false\",\"false\"),\"\")","v":0.52721906897000004},{"$f":"IFERROR(_xll.ECONOMATICA($F$7&\"<XBSP>\",\"GrossMargin\",\"12M\",F$29,,,,\"decimal\",\"false\",\"false\"),\"\")","v":0.52235480347999996}]
[null,"ROE Rent Pat (pat final)",{"$f":"IFERROR(_xll.ECONOMATICA($F$7&\"<XBSP>\",\"ROE (end)\",\"12M\",C$29,,,,\"decimal\",\"false\",\"false\"),\"\")","v":0.42167341336000003},null,{"$f":"IFERROR(_xll.ECONOMATICA($F$7&\"<XBSP>\",\"ROE (end)\",,E$29,,,,\"decimal\",\"false\",\"false\"),\"\")","v":0.32736831093000002},{"$f":"IFERROR(_xll.ECONOMATICA($F$7&\"<XBSP>\",\"ROE (end)\",\"12M\",F$29,,,,\"decimal\",\"false\",\"false\"),\"\")","v":0.21066375916999999}]
[null,"Margem Líquida",{"$f":"IFERROR(_xll.ECONOMATICA($F$7&\"<XBSP>\",\"Net Margin\",\"12M\",C$29,,,,\"decimal\",\"false\",\"false\"),\"\")","v":0.26992948312999998},null,{"$f":"IFERROR(_xll.ECONOMATICA($F$7&\"<XBSP>\",\"Net Margin\",,E$29,,,,\"decimal\",\"false\",\"false\"),\"\")","v":0.24446770861},{"$f":"IFERROR(_xll.ECONOMATICA($F$7&\"<XBSP>\",\"Net Margin\",\"12M\",F$29,,,,\"decimal\",\"false\",\"false\"),\"\")","v":0.15873283039}]
[null,"Dívida Bruta / Pat Liq",{"$f":"IFERROR(_xll.ECONOMATICA($F$7&\"<XBSP>\",\"DebtGr/StkEq\",,C$29,,,,\"Decimal\",\"false\",\"false\"),\"\")","v":0.75044119898999995},null,{"$f":"IFERROR(_xll.ECONOMATICA($F$7&\"<XBSP>\",\"DebtGr/StkEq\",,E$29,,,,\"Decimal\",\"false\",\"false\"),\"\")","v":0.79265052047999995},{"$f":"IFERROR(_xll.ECONOMATICA($F$7&\"<XBSP>\",\"DebtGr/StkEq\",,F$29,,,,\"Decimal\",\"false\",\"false\"),\"\")","v":0.88148335284000001}]
[null,"Liquidez Corrente",{"$f":"IFERROR(_xll.ECONOMATICA($F$7&\"<XBSP>\",\"CurrRatio\",,C$29,,,,,\"false\",\"false\"),\"\")","v":0.90248616416000005},null,{"$f":"IFERROR(_xll.ECONOMATICA($F$7&\"<XBSP>\",\"CurrRatio\",,E$29,,,,,\"false\",\"false\"),\"\")","v":0.95821946219999998},{"$f":"IFERROR(_xll.ECONOMATICA($F$7&\"<XBSP>\",\"CurrRatio\",,F$29,,,,,\"false\",\"false\"),\"\")","v":0.89514080867000001}]
[]
[null,"Balanço",{"$f":"IFERROR(IF(MONTH(F38)=12,DATE(YEAR(F38)-2,MONTH(F38)+1,0),DATE(YEAR(F38)-1,MONTH(F38)+1,0)),\"\")","v":"2023-06-30"},null,{"$f":"IFERROR(DATE(YEAR(F38),1,0),\"\")","v":"2023-12-31"},{"$f":"IFERROR(_xll.ECONOMATICA($F$7&\"<XBSP>\",\"Fin Statm Date\",,CHOOSE(ROUNDUP(MONTH(G21)/3,0),\"<dez/\"&YEAR(G21)-1,\"<mar/\"&YEAR(G21),\"<jun/\"&YEAR(G21),\"<set/\"&YEAR(G21))),IFERROR(_xll.ECONOMATICA(F7&\"<XBSP>\",\"Fin Statm Date\"),\"\"))","v":"2024-06-30"}]
[null,"Ativo total",{"$f":"IFERROR(_xll.ECONOMATICA($F$7&\"<XBSP>\",\"Total Assets\",,C$38,,,,,\"false\",\"false\"),\"\")","v":990459000000},null,{"$f":"IFERROR(_xll.ECONOMATICA($F$7&\"<XBSP>\",\"Total Assets\",,E$38,,,,,\"false\",\"false\"),\"\")","v":1050888000000},{"$f":"IFERROR(_xll.ECONOMATICA($F$7&\"<XBSP>\",\"Total Assets\",,F$38,,,,,\"false\",\"false\"),\"\")","v":1058688000000}]
[null,"Patrimônio líquido",{"$f":"IFERROR(_xll.ECONOMATICA($F$7&\"<XBSP>\",\"Stock Eq Par\",,C$38,,,,,\"false\",\"false\"),\"\")","v":370683000000},null,{"$f":"IFERROR(_xll.ECONOMATICA($F$7&\"<XBSP>\",\"Stock Eq Par\",,E$38,,,,,\"false\",\"false\"),\"\")","v":380441000000},{"$f":"IFERROR(_xll.ECONOMATICA($F$7&\"<XBSP>\",\"Stock Eq Par\",,F$38,,,,,\"false\",\"false\"),\"\")","v":373479000000},null,null,"Lucro Líquido - Trimestral (atualizado pela inflação)",null,null,null,null,null,null,null,null,"Selecione Um Período →","Período: ","10Y"]
{"$rows_left_out":10}
{"sheet":"Base_Gráficos","index":1,"n_rows":272,"n_cols":10,"rows_kept":272,"cut":false,"hidden":false,"merged":[[7,5,7,6],[7,8,7,9],[7,1,7,4],[3,5,3,7],[4,5,4,7],[5,5,5,7]]}
[null,null,null,"Planilha Auxiliar Não Modificar"]
[null,"Ativo: ",{"$f":"'Lâmina_Ações Básica'!F7&\"<XBSP>\"","v":"PETR4<XBSP>"},null,"Ano Inicial:",{"$f":"IF('Lâmina_Ações Básica'!T40=\"DESDE O INÍCIO\",C3,'Lâmina_Ações Básica'!T40)","v":"10Y"}]
[null,"Ínicio da Série: ",{"$f":"_xll.ECONOMATICA(C2,\"Series Start Date\")","v":"1986-01-02"}]
[null,"Data: ",{"$f":"'Lâmina_Ações Básica'!C2","v":"2024-09-26"},null,"Mínimo:",{"$f":"ROUNDDOWN(MIN(F$10:G$1048576),-1)","v":90}]
[null,"Final: ",{"$f":"IF('Lâmina_Ações Básica'!T9=\"DESDE O INÍCIO\",C3,'Lâmina_Ações Básica'!T9)","v":"1Y"},null,"Máximo:",{"$f":"ROUNDUP(MAX($F$10:$G$500),-1)","v":140}]
[null,"Intervalo: ",{"$f":"'Lâmina_Ações Básica'!R9","v":"D"},null,"VBA Gráfico:",{"$f":"AtualizarLimitesGrafico(\"Lâmina_Ações Básica\",\"Base100\",F4,F5)","v":{"$error":"#VALUE!"}}]
[]
[null,"Gráfico de Preço da Ação",null,null,null,"Gráfico de Performance Relativa",null,"Gráfico Preço/Lucro","Gráfico Lucro Líquido"]
[null,"Data","Máximo","Mínimo","Fechamento",{"$f":"'Lâmina_Ações Básica'!F7","v":"PETR4"},{"$f":"'Lâmina_Ações Básica'!T19","v":"IBOV"},"P/L","Data","Lucro Líquido"]
[null,{"$f":"_xll.ECONOMATICA($C$2,\"high\",,$C$4,$C$5,$C$6,,,\"true\",\"false\",,)","v":"2023-09-26"},28.923645869000001,{"$f":"_xll.ECONOMATICA($C$2,\"Low\",,$C$4,$C$5,$C$6,,,\"FALSE\",\"false\")","v":28.38912264},{"$f":"_xll.ECONOMATICA($C$2,\"close\",,$C$4,$C$5,$C$6,,,\"FALSE\",\"false\")","v":28.38912264},{"$f":"_xll.ECONOMATICA($C$2,\"close\",,$C$4,$C$5,$C$6,,,\"false\",\"false\",,{\"def.defdef=7\"})","v":100},{"$f":"_xll.ECONOMATICA($G$9,\"close\",,$C$4,$C$5,$C$6,,,\"FALSE\",\"false\",,{\"def.defdef=7\"})","v":100},{"$f":"_xll.ECONOMATICA(C2,\"P/E\",\"12M\",$C$4,$C$5,$C$6,,,\"false\",\"false\")","v":2.7911045512000001},{"$f":"_xll.ECONOMATICA($C$2,\"Net Income\",\"3M\",C4,F2,\"Q\",\"INFLATION ADJUSTED\",,\"true\",\"false\")","v":"2014-09-30"},-9318940565.5]
[null,"2023-09-27",29.288479185,28.660626502,29.288479185,103.16796174,100.11701198,2.8795256756000001,"2014-12-31",-45644075354]
[null,"2023-09-28",29.305448175999999,29.025459818000002,29.229087714999999,102.95875672,101.34625083,2.8736865448,"2015-03-31",8808791600.1000004]
[null,"2023-09-29",29.432715611999999,29.059397800999999,29.390293133,103.52659892,102.07694961,2.8895356143000002,"2015-06-30",858206223.76999998]
[null,"2023-10-02",29.500591577000002,28.787893938,28.949099356000001,101.97250448,100.7561118,3.2509310234000002,"2015-09-30",-5992276878.3000002]
[null,"2023-10-03",29.042428809,28.533359066999999,28.821831921000001,101.524208,99.321861161000001,3.2366391226000002,"2015-12-31",-57270703426]
[null,"2023-10-04",28.601235032000002,27.481281598999999,27.676424999999998,97.489539749000002,99.486853139999994,3.1080120159,"2016-03-31",-1882529297.5]
[null,"2023-10-05",27.947928863000001,27.396436642000001,27.769754453000001,97.818290496000003,99.203675727999993,3.1184927431,"2016-06-30",549404921.75999999]
[null,"2023-10-06",28.694564485000001,27.430374624999999,28.431545117999999,100.14943215,99.979158170999995,3.1928106270000001,"2016-09-30",-24185852440]
[null,"2023-10-09",29.763610944,28.932130364999999,29.653312499999998,104.4530783,100.8429907,3.3300128741999999,"2016-12-31",3661410323.8000002]
[null,"2023-10-10",29.984207832999999,29.475138090000002,29.873909389000001,105.23012552,102.22737858000001,3.3547855021999999,"2017-03-31",6427982728.1999998]
[null,"2023-10-11",29.907847370999999,29.263025698,29.797548927000001,104.96114763,102.50216671,3.3462103616999999,"2017-06-30",455562102.13999999]
[null,"2023-10-12",null,null,null,null,null,3.3462103616999999,"2017-09-30",381225894.27999997]
[null,"2023-10-13",30.849626395000001,30.357525643999999,30.781750428999999,108.4279737,101.36667232000001,3.4567343942000002,"2017-12-31",-7760724199.1000004]
[null,"2023-10-16",31.222944206000001,30.510246566999999,31.121130258000001,109.62343095999999,102.04952246000001,3.4948461295,"2018-03-31",9794793820]
[null,"2023-10-17",31.961095332999999,31.078707778999998,31.961095332999999,112.58218768,101.50183771,3.5891726743999999,"2018-06-30",13909558573]
[null,"2023-10-18",32.758637929000002,32.16472323,32.682277468000002,115.12253436,99.882839144000002,3.670160112,"2018-09-30",9109779323.2000008]
[null,"2023-10-19",32.639854989,32.173207726000001,32.529556544999998,114.5845786,99.834377512000003,3.6530098310999999,"2018-12-31",2870932802.0999999]
[null,"2023-10-20",32.970750322000001,31.723529453000001,32.113816256,113.12014345,99.090884650999996,3.6063229553,"2019-03-31",5423842538.1000004]
[null,"2023-10-23",31.222944206000001,29.916331867,29.992692328,105.64853556,98.766207477999998,3.3681246095000001,"2019-06-30",25205656371]
[null,"2023-10-24",30.705389967999999,29.839971406,30.442370601,107.23251643,99.622106105,3.4186226587999999,"2019-09-30",12109065368]
[null,"2023-10-25",30.781750428999999,30.332072156999999,30.603576019999998,107.80035863000001,98.806008367000004,3.4367257330999998,"2019-12-31",10675747673]
[null,"2023-10-26",30.484793079999999,29.823002414000001,30.289649678,106.69456065999999,100.5109138,3.4014723778999998,"2020-03-31",-63201757998]
[null,"2023-10-27",30.934471351999999,29.839971406,30.069052790000001,105.91751343999999,99.218799189999999,3.3766997500000002,"2020-06-30",-3548995714.4000001]
[null,"2023-10-30",30.306618669999999,29.576952038999998,29.763610944,104.84160190999999,98.544653576000002,3.3423991881999999,"2020-09-30",-1997527799.3]
[null,"2023-10-31",29.848455901000001,29.263025698,29.475138090000002,103.82546324,99.080717691000004,3.3100042132,"2020-12-31",75032050748]
[null,"2023-11-01",30.153897746999998,29.610890022,29.797548927000001,104.96114763,100.75269654,3.3462103616999999,"2021-03-31",1432648803.0999999]
[null,"2023-11-02",null,null,null,null,null,3.3462103616999999,"2021-06-30",51741701297]
[null,"2023-11-03",30.450855097000002,29.738157457,30.153897746999998,106.21637776,103.47352733,3.3862276838000001,"2021-09-30",36497702098]
[null,"2023-11-06",30.654482993999999,30.128444259999998,30.128444259999998,106.12671847,103.71108915000001,3.3833693036999999,"2021-12-31",35861176327]
[null,"2023-11-07",30.052083798000002,29.407262124999999,29.627859012999998,104.36341899999999,104.44388963,3.3271544941000002,"2022-03-31",49150882311]
{"$rows_left_out":233}
{"sheet":"Base","index":2,"n_rows":152,"n_cols":6,"rows_kept":152,"cut":false,"hidden":false,"merged":[]}
[null,null,null,"Planilha Auxiliar Não Modificar"]
[]
[null,{"$f":"_xll.ECOSECURITIES(\"stock\",\"active\",,\"bra\",\"xbsp\",,,\"Partic in Ibovespa>0\")","v":"Código"},{"$f":"_xll.ECONOMATICA($B$4:$B$201,\"TICKER\")","v":"Código"},{"$f":"_xll.ECONOMATICA($B$4:$B$201,\"NAME\")","v":"Nome"},{"$f":"_xll.ECONOMATICA($B$4:$B$201,\"CLASS\")","v":"Classe"},"Nome e Classe"]
[null,"ALOS3<XBSP>","ALOS3","Allos","ON",{"$f":"CONCATENATE(D4,\" \",E4)","v":"Allos ON"}]
[null,"ALPA4<XBSP>","ALPA4","Alpargatas","PN",{"$f":"CONCATENATE(D5,\" \",E5)","v":"Alpargatas PN"}]
[null,"ABEV3<XBSP>","ABEV3","Ambev S/A","ON","Ambev S/A ON"]
[null,"ASAI3<XBSP>","ASAI3","Assai","ON","Assai ON"]
[null,"AURE3<XBSP>","AURE3","Auren","ON","Auren ON"]
[null,"AZUL4<XBSP>","AZUL4","Azul","PN","Azul PN"]
[null,"AZZA3<XBSP>","AZZA3","Azzas 2154","ON","Azzas 2154 ON"]
[null,"B3SA3<XBSP>","B3SA3","B3","ON","B3 ON"]
[null,"BBSE3<XBSP>","BBSE3","BBSeguridade","ON","BBSeguridade ON"]
[null,"BBDC3<XBSP>","BBDC3","Bradesco","ON","Bradesco ON"]
[null,"BBDC4<XBSP>","BBDC4","Bradesco","PN","Bradesco PN"]
[null,"BRAP4<XBSP>","BRAP4","Bradespar","PN","Bradespar PN"]
[null,"BBAS3<XBSP>","BBAS3","Brasil","ON","Brasil ON"]
[null,"BRKM5<XBSP>","BRKM5","Braskem","PNA","Braskem PNA"]
[null,"BRAV3<XBSP>","BRAV3","Brava","ON","Brava ON"]
[null,"BRFS3<XBSP>","BRFS3","BRF SA","ON","BRF SA ON"]
[null,"BPAC11<XBSP>","BPAC11","Btgp Banco","UNT","Btgp Banco UNT"]
[null,"CXSE3<XBSP>","CXSE3","Caixa Seguri","ON","Caixa Seguri ON"]
[null,"CRFB3<XBSP>","CRFB3","Carrefour BR","ON","Carrefour BR ON"]
[null,"CCRO3<XBSP>","CCRO3","CCR SA","ON","CCR SA ON"]
[null,"CMIG4<XBSP>","CMIG4","Cemig","PN","Cemig PN"]
[null,"COGN3<XBSP>","COGN3","Cogna ON","ON","Cogna ON ON"]
[null,"CPLE6<XBSP>","CPLE6","Copel","PNB","Copel PNB"]
[null,"CSAN3<XBSP>","CSAN3","Cosan","ON","Cosan ON"]
[null,"CPFE3<XBSP>","CPFE3","CPFL Energia","ON","CPFL Energia ON"]
[null,"CMIN3<XBSP>","CMIN3","Csn Mineracao","ON","Csn Mineracao ON"]
[null,"CVCB3<XBSP>","CVCB3","Cvc Brasil","ON","Cvc Brasil ON"]
[null,"CYRE3<XBSP>","CYRE3","Cyrela Realt","ON","Cyrela Realt ON"]
[null,"ELET3<XBSP>","ELET3","Eletrobras","ON","Eletrobras ON"]
[null,"ELET6<XBSP>","ELET6","Eletrobras","PNB","Eletrobras PNB"]
[null,"EMBR3<XBSP>","EMBR3","Embraer","ON","Embraer ON"]
[null,"ENGI11<XBSP>","ENGI11","Energisa","UNT N2","Energisa UNT N2"]
[null,"ENEV3<XBSP>","ENEV3","Eneva","ON","Eneva ON"]
[null,"EGIE3<XBSP>","EGIE3","Engie Brasil","ON","Engie Brasil ON"]
[null,"EQTL3<XBSP>","EQTL3","Equatorial","ON","Equatorial ON"]
[null,"EZTC3<XBSP>","EZTC3","Eztec","ON","Eztec ON"]
[null,"FLRY3<XBSP>","FLRY3","Fleury","ON","Fleury ON"]
{"$rows_left_out":112}