{"text_format":"1","workbook":"xlsx","n_sheets":4,"sheets":["Lâmina De RI","Base Auxiliar","Base Ibov","Versão"],"not_rendered":{"charts":8,"images":1,"macros":1,"external_links":0,"defined_names":76,"comments":0,"pivot_tables":0},"unopened":[],"bounds":{"document_bytes":16777216,"sheet_cells":100000,"rows_first":2000,"rows_last":500,"rows_between":2000,"halvings":0,"cell_chars":16384,"cell_head_chars":4096},"cells_cut":0,"cells_raw":0,"read":"whole","date_system":"1900"}

{"sheet":"Lâmina De RI","index":0,"n_rows":191,"n_cols":20,"rows_kept":191,"cut":false,"hidden":false,"merged":[[172,1,172,6],[172,7,172,13],[112,1,112,13],[132,1,132,13],[144,1,144,6],[144,7,144,13],[162,1,162,13],[50,1,51,13],[14,3,15,3],[14,4,15,4],[19,3,20,3],[19,4,20,4],[24,3,25,3],[24,4,25,4],[29,3,30,3],[29,4,30,4],[47,8,47,13],[48,8,48,13],[46,8,46,13],[32,2,32,4],[32,5,32,7],[41,1,41,11],[8,1,8,13],[32,11,32,13],[33,11,33,13],[44,8,44,13],[45,8,45,13],[10,1,10,4],[17,1,17,4],[22,1,22,4],[27,1,27,4],[10,6,10,8],[190,7,190,8],[128,11,129,13],[142,7,142,8],[130,7,130,13],[121,7,121,8],[121,9,121,10],[121,11,121,13],[128,7,129,8],[126,7,127,8],[126,9,127,10],[128,9,129,10],[126,11,127,13],[55,8,55,13],[60,9,60,13],[61,9,61,13],[62,9,62,13],[63,9,63,13],[57,9,57,13],[58,9,58,13],[59,9,59,13],[74,9,74,13],[95,9,95,13],[96,9,96,13],[91,9,91,13],[92,9,92,13],[64,9,64,13],[65,9,65,13],[66,9,66,13],[72,9,72,13],[73,9,73,13],[79,9,79,13],[80,9,80,13],[104,1,104,2],[108,1,108,2],[100,1,100,2],[100,3,100,4],[98,9,98,10],[98,7,98,8],[122,9,122,13],[124,9,124,13],[93,9,93,13],[94,9,94,13],[53,12,53,13],[68,12,68,13],[83,12,83,13],[89,9,89,13],[90,9,90,13],[81,9,81,13],[70,8,70,13],[85,8,85,13],[87,9,87,13],[88,9,88,13],[75,9,75,13],[76,9,76,13],[77,9,77,13],[78,9,78,13]]}
[null,null,null,null,"Lâmina Individual de RI"]
[]
[null,"Ticker: ","GGBR4","← Digitar Um Código"]
[null,"Dta. Últ. Balanço: ",{"$f":"_xll.ECONOMATICA($C$3,\"Fin Statm Date\")","v":"2024-06-30"},"← Não Modificar"]
[null,"Dta. Últ. Cot.: ",{"$f":"IF($C$6=\"\",_xll.ECONOMATICA($C$3,\"DATE OF LAST QUOTE\"),$C$6)","v":"2024-09-24"},"← Não Modificar"]
[null,"Dta. Pref. Últ. Cot.: ",null,"← Para alterar a data da Célula E2, basta digitar na Célula E3"]
[null,"Unidades: ","Millions","← Selecionar Unidades"]
[]
[null,"Relação com Investidores"]
[]
[null,"Diário",null,null,null,null,"Volume x Fechamento",null,null,null,null,null,"Selecionar um Período (D = Dias; W = Semanas; M = Mês; Q = Trimestre; Y = Anos) →","36M"]
[]
[null,"Abertura",{"$f":"IFERROR(_xll.ECONOMATICA($C$3,\"OPEN\",,$C$5,,,,,,\"FALSE\"),\"-\")","v":18.22},"Fechamento",{"$f":"IFERROR(_xll.ECONOMATICA($C$3,\"CLOSE\",,$C$5,,,,,,\"FALSE\"),\"-\")","v":18.48}]
[]
[null,"Máximo ",{"$f":"IFERROR(_xll.ECONOMATICA($C$3,\"HIGH\",,$C$5,,,,,,\"FALSE\"),\"-\")","v":18.649999999999999},"Variação %",{"$f":"IFERROR(_xll.ECONOMATICA($C$3,\"return\",\"1D\",$C$5,,,,\"decimal\",,\"FALSE\"),\"-\")","v":4.1713641489000003E-2}]
[null,"Mínimo ",{"$f":"IFERROR(_xll.ECONOMATICA($C$3,\"LOW\",,$C$5,,,,,,\"FALSE\"),\"-\")","v":18.100000000000001}]
[]
[null,"7 Dias"]
[]
[null,"Máximo ",{"$f":"IFERROR(_xll.ECONOMATICA($C$3,\"HIGH\",\"7D\",$C$5,,,,,,\"FALSE\"),\"-\")","v":18.82},"Variação %",{"$f":"IFERROR(_xll.ECONOMATICA($C$3,\"return\",\"7D\",$C$5,,,,\"decimal\",,\"FALSE\"),\"-\")","v":-1.7021276594E-2}]
[null,"Mínimo ",{"$f":"IFERROR(_xll.ECONOMATICA($C$3,\"LOW\",\"7D\",$C$5,,,,,,\"FALSE\"),\"-\")","v":17.63}]
[]
[null,"4 Semanas"]
[]
[null,"Máximo ",{"$f":"IFERROR(_xll.ECONOMATICA($C$3,\"HIGH\",\"4W\",$C$5,,,,,,\"FALSE\"),\"-\")","v":18.95},"Variação %",{"$f":"IFERROR(_xll.ECONOMATICA($C$3,\"return\",\"4w\",$C$5,,,,\"decimal\",,\"FALSE\"),\"-\")","v":1.1494252874000001E-2}]
[null,"Mínimo ",{"$f":"IFERROR(_xll.ECONOMATICA($C$3,\"LOW\",\"4W\",$C$5,,,,,,\"FALSE\"),\"-\")","v":17.63}]
[]
[null,"52 Semanas"]
[]
[null,"Máximo ",{"$f":"IFERROR(_xll.ECONOMATICA($C$3,\"HIGH\",\"52W\",$C$5,,,,,,\"FALSE\"),\"-\")","v":20.299920046},"Variação %",{"$f":"IFERROR(_xll.ECONOMATICA($C$3,\"return\",\"52w\",$C$5,,,,\"decimal\",,\"FALSE\"),\"-\")","v":-5.0564658104000001E-2}]
[null,"Mínimo ",{"$f":"IFERROR(_xll.ECONOMATICA($C$3,\"LOW\",\"52W\",$C$5,,,,,,\"FALSE\"),\"-\")","v":16.565688177999998}]
[]
[null,null,"Volume $",null,null,"Quantidade de Ações",null,null,"Quantidade de Negócios",null,null,"% Total de Ações"]
[null,null,null,{"$f":"$C$7","v":"Millions"},null,null,{"$f":"$C$7","v":"Millions"},null,{"$f":"$C$7","v":"Millions"},null,null,{"$f":"$C$7","v":"Millions"}]
[]
[null,"No Dia ",null,{"$f":"IFERROR(_xll.ECONOMATICA($C$3,\"volume$\",\"1d\",$C$5,,,,C7,,\"false\",\"false\"),\"-\")","v":310.86441200000002},null,null,{"$f":"IFERROR(_xll.ECONOMATICA($C$3,\"#SHARES\",\"1d\",$C$5,,,,C7,,\"false\",\"false\"),\"-\")","v":16.852399999999999},null,{"$f":"IFERROR(_xll.ECONOMATICA($C$3,\"#TRADES\",\"1d\",$C$5,,,,C7,,\"false\",\"false\"),\"-\")","v":3.0428E-2}]
[null,"Média 7 Dias",null,{"$f":"IFERROR(_xll.ECONOMATICA($C$3,\"Hist Average\",\"1w\",$C$5,,,,C7,,\"false\",\"false\",{\"std.tec.cals=7\"}),\"-\")","v":278.49705760000001},null,null,{"$f":"IFERROR(_xll.ECONOMATICA($C$3,\"Hist Average\",\"1w\",$C$5,,,,C7,,\"false\",\"false\",{\"std.tec.cals=6\"}),\"-\")","v":15.233639999999999},null,{"$f":"IFERROR(_xll.ECONOMATICA($C$3,\"Hist Average\",\"1w\",$C$5,,,,C7,,\"false\",\"false\",{\"std.tec.cals=5\"}),\"-\")","v":2.2916200000000001E-2},null,null,"Emitidas",{"$f":"IFERROR(_xll.ECONOMATICA($C$3,\"Num of Shares\",,$C$5,,,,C7,\"false\",\"false\",,{\"std.bac.totex=0\"}),\"-\")","v":2108.4804600000002},{"$f":"M37/$M$37","v":1}]
[null,"Média 4 Semanas",null,{"$f":"IFERROR(_xll.ECONOMATICA($C$3,\"Hist Average\",\"4W\",$C$5,,,,C7,,\"false\",\"false\",{\"std.tec.cals=7\"}),\"-\")","v":228.01554275000001},null,null,{"$f":"IFERROR(_xll.ECONOMATICA($C$3,\"Hist Average\",\"4W\",$C$5,,,,C7,,\"false\",\"false\",{\"std.tec.cals=6\"}),\"-\")","v":12.434089999999999},null,{"$f":"IFERROR(_xll.ECONOMATICA($C$3,\"Hist Average\",\"4W\",$C$5,,,,C7,,\"false\",\"false\",{\"std.tec.cals=5\"}),\"-\")","v":1.9001150000000001E-2},null,null,"Outstanding",{"$f":"IFERROR(_xll.ECONOMATICA($C$3,\"Num of Shares\",,$C$5,,,,C7,\"false\",\"false\",,),\"-\")","v":2103.6516179999999},{"$f":"M38/$M$37","v":0.99770979997604514}]
[null,"Média 52 Semanas",null,{"$f":"IFERROR(_xll.ECONOMATICA($C$3,\"Hist Average\",\"52w\",$C$5,,,,C7,,\"false\",\"false\",{\"std.tec.cals=7\"}),\"-\")","v":217.12242581000001},null,null,{"$f":"IFERROR(_xll.ECONOMATICA($C$3,\"Hist Average\",\"52w\",$C$5,,,,C7,,\"false\",\"false\",{\"std.tec.cals=6\"}),\"-\")","v":11.76157759},null,{"$f":"IFERROR(_xll.ECONOMATICA($C$3,\"Hist Average\",\"52w\",$C$5,,,,C7,,\"false\",\"false\",{\"std.tec.cals=5\"}),\"-\")","v":2.0878164659000002E-2},null,null,"Tesouraria",{"$f":"IFERROR(_xll.ECONOMATICA($C$3,\"Num of Shares\",,$C$5,,,,C7,\"false\",\"false\",,{\"std.bac.totex=1\"}),\"-\")","v":4.8288419999999999},{"$f":"M39/$M$37","v":2.2902000239546916E-3}]
[]
[]
[null,"Acionistas",null,null,null,null,null,null,null,null,null,null,"Data Referência: ",{"$f":"_xll.ECONOMATICA($C$3,\"ShrHoldrs AmendDt\",,,,,,,\"false\",\"false\")","v":"2024-06-01"}]
[]
[null,"Posição","% Ações","Nome"]
[null,1,{"$f":"IFERROR(_xll.ECONOMATICA($C$3,\"ShrsHold\",,\"LATEST\",,,,\"decimal\",\"false\",\"false\",,'Base Auxiliar'!D12),\"-\")","v":"-"},{"$f":"IFERROR(_xll.ECONOMATICA($C$3,\"MainShHol\",,\"LATEST\",,,,,\"false\",\"false\",,'Base Auxiliar'!C12),\"-\")","v":"-"}]
[null,2,{"$f":"IFERROR(_xll.ECONOMATICA($C$3,\"ShrsHold\",,\"LATEST\",,,,\"decimal\",\"false\",\"false\",,'Base Auxiliar'!D13),\"-\")","v":"-"},{"$f":"IFERROR(_xll.ECONOMATICA($C$3,\"MainShHol\",,\"LATEST\",,,,,\"false\",\"false\",,'Base Auxiliar'!C13),\"-\")","v":"-"}]
[null,3,{"$f":"IFERROR(_xll.ECONOMATICA($C$3,\"ShrsHold\",,\"LATEST\",,,,\"decimal\",\"false\",\"false\",,'Base Auxiliar'!D14),\"-\")","v":"-"},{"$f":"IFERROR(_xll.ECONOMATICA($C$3,\"MainShHol\",,\"LATEST\",,,,,\"false\",\"false\",,'Base Auxiliar'!C14),\"-\")","v":"-"}]
[null,4,{"$f":"IFERROR(_xll.ECONOMATICA($C$3,\"ShrsHold\",,\"LATEST\",,,,\"decimal\",\"false\",\"false\",,'Base Auxiliar'!D15),\"-\")","v":"-"},{"$f":"IFERROR(_xll.ECONOMATICA($C$3,\"MainShHol\",,\"LATEST\",,,,,\"false\",\"false\",,'Base Auxiliar'!C15),\"-\")","v":"-"}]
[null,5,{"$f":"IFERROR(_xll.ECONOMATICA($C$3,\"ShrsHold\",,\"LATEST\",,,,\"decimal\",\"false\",\"false\",,'Base Auxiliar'!D16),\"-\")","v":"-"},{"$f":"IFERROR(_xll.ECONOMATICA($C$3,\"MainShHol\",,\"LATEST\",,,,,\"false\",\"false\",,'Base Auxiliar'!C16),\"-\")","v":"-"}]
[]
[null,"Obs.: As informações abaixo referentes às posições (long, short e doada) consolidadas das gestoras deverá ser extraida da Plataforma Web Economatica através da do relatório \"Fundos ou Índices que têm esse Ativo - FQTA\". Há um delay de 3 meses para as carteiras divulgadas, considerando a prerrogativa dos fundos em ocultar suas carteiras neste período. Para maiores informações, entre em contato com nosso suporte através do info@economatica.com.br"]
[]
[]
[null,"Top 10 Gestoras - Fundos comprados em Ações (long) - Thousands",null,null,null,null,null,null,null,null,null,null,"Data Referência: Fevereiro/22"]
[]
[null,"Posição","Gestora",null,null,null,null,null,"Posição $"]
[]
[null,1,"Miles Capital Ltda.",null,null,null,null,null,null,144256.38375000001]
[null,2,"Xp Gestão de Recursos Ltda",null,null,null,null,null,null,142406.06343000001]
[null,3,"Fundação Petrobras de Seguridade Social - Petros",null,null,null,null,null,null,126201.192]
[null,4,"Safra Asset Management Ltda.",null,null,null,null,null,null,118496.47293]
[null,5,"BTG Pactual Wm Gestão de Recursos Ltda",null,null,null,null,null,null,115956.73305]
[null,6,"Itau Unibanco Asset Management Ltda.",null,null,null,null,null,null,107829.83663999999]
[null,7,"Constellation Investimentos e Participações Ltda",null,null,null,null,null,null,80277.080310000005,null,null,null,null,null,null,null,null,null," "]
[null,8,"Bogari Gestão de Investimentos Ltda.",null,null,null,null,null,null,78761.282160000002]
[null,9,"Navi Capital Administradora e Gestora de Recursos Financeiros Ltda.",null,null,null,null,null,null,65354.248319999999]
[null,10,"Apolo Investimentos Ltda",null,null,null,null,null,null,53180.541149999997]
[]
[null,"Top 10 Gestoras - Fundos vendidos em Ações (short) - Thousands",null,null,null,null,null,null,null,null,null,null,"Data Referência: Fevereiro/22"]
[]
[null,"Posição","Gestora",null,null,null,null,null,"Posição $"]
[]
[null,1,"Itau Unibanco Asset Management Ltda.",null,null,null,null,null,null,-63351.670169999998]
[null,2,"Miles Capital Ltda.",null,null,null,null,null,null,-50249.74308]
[null,3,"Occam Brasil Gestão de Recursos Ltda.",null,null,null,null,null,null,-20029.88436]
[null,4,"Ibiuna Macro Gestão de Recursos Ltda.",null,null,null,null,null,null,-18529.628400000001]
[null,5,"Stk Capital Gestora de Recursos Ltda.",null,null,null,null,null,null,-16410.362130000001]
[null,6,"Ibiuna Ações Gestão de Recursos Ltda.",null,null,null,null,null,null,-13915.127850000001]
[null,7,"Itaverá Gestão de Recursos Ltda",null,null,null,null,null,null,-9544.3649999999998]
[null,8,"E2m Investimentos Ltda.",null,null,null,null,null,null,-8821.1489999999994]
[null,9,"Spx Gestão de Recursos Ltda",null,null,null,null,null,null,-7159.2473099999997]
[null,10,"Apex Capital Ltda",null,null,null,null,null,null,-6506.2319399999997]
[]
[null,"Top 10 Gestoras - Fundos Doados em Ações (Aluguel) - Thousands",null,null,null,null,null,null,null,null,null,null,"Data Referência: Fevereiro/22"]
[]
[null,"Posição","Gestora",null,null,null,null,null,"Posição $"]
[]
[null,1,"BTG Pactual Wm Gestão de Recursos Ltda",null,null,null,null,null,null,57246.544950000003]
[null,2,"Fundação Dos Economiários Federais - Funcef",null,null,null,null,null,null,54623.148450000001]
[null,3,"Squadra Investimentos - Gestão de Recursos Ltda.",null,null,null,null,null,null,35768.072849999997]
[null,4,"Apolo Investimentos Ltda",null,null,null,null,null,null,27769.0605]
[null,5,"Rps Capital Administradora de Recursos Ltda",null,null,null,null,null,null,22836.831689999999]
[null,6,"Itau Dtvm S.A.",null,null,null,null,null,null,19285.006649999999]
[null,7,"Bogari Gestão de Investimentos Ltda.",null,null,null,null,null,null,17922.16173]
[null,8,"Itau Unibanco S.A.",null,null,null,null,null,null,14459.591280000001]
[null,9,"Itau Unibanco Asset Management Ltda.",null,null,null,null,null,null,13906.22673]
[null,10,"Constellation Investimentos e Participações Ltda",null,null,null,null,null,null,11738.24769]
[]
[null,"Financials",null,null,null,null,null,null,null,"Balanço Histórico",null,null,"Data Referência:",{"$f":"LOOKUP(2,1/(LEN('Base Auxiliar'!$S:$S)>0),'Base Auxiliar'!$S:$S)","v":"2024-12-31"}]
[]
[null,"Indicadores de Valuation - 12 Meses"]
[null,"P/L",{"$f":"IFERROR(_xll.ECONOMATICA($C$3,\"P/E\",,$C$5,,,,,,\"false\"),\"\")","v":7.6666541794}]
[null,"P/VPA",{"$f":"IFERROR(_xll.ECONOMATICA($C$3,\"P/bv\",,$C$5,,,,,,\"false\"),\"\")","v":0.70515624899999996}]
[]
[null,"Indicadores de Rentabilidade - 12 Meses"]
[null,"ROE %",{"$f":"IFERROR(_xll.ECONOMATICA($C$3,\"ROE (avg)\",,#REF!,,,,\"decimal\",,\"false\"),\"\")","v":""}]
[null,"ROA %",{"$f":"IFERROR(_xll.ECONOMATICA($C$3,\"ROA\",,#REF!,,,,\"decimal\",,\"false\"),\"\")","v":""}]
[]
[null,"Indicadores Financeiros - 12 Meses"]
[null,"Lucro por Ação",{"$f":"IFERROR(_xll.ECONOMATICA($C$3,\"EPS\",\"12M\",#REF!,,,,,,\"false\"),\"\")","v":""}]
[null,"Valor Patr. por Ação",{"$f":"IFERROR(_xll.ECONOMATICA($C$3,\"BVperShare\",,#REF!,,,,,,\"false\"),\"\")","v":""}]
[]
[null,"Índices Mercado"]
[]
[null,null,"No Dia","No Mês","No Ano","1M","3M","6M","12M","24M","36M","48M","60M","90M",null,"CÓDIGOS ECONOMATICA"]
[null,"Ibovespa",{"$f":"_xll.ECONOMATICA($P$116:$P$119,\"RETURN\",\"1D\",$C$5,,,,\"DECIMAL\",\"FALSE\",\"FALSE\")","v":1.2157538612E-2},{"$f":"_xll.ECONOMATICA($P$116:$P$119,\"RETURN\",\"MTD\",$C$5,,,,\"DECIMAL\",\"FALSE\",\"FALSE\")","v":-2.8295121592000001E-2},{"$f":"_xll.ECONOMATICA($P$116:$P$119,\"RETURN\",\"YTD\",$C$5,,,,\"DECIMAL\",\"FALSE\",\"FALSE\")","v":-1.5124465254E-2},{"$f":"_xll.ECONOMATICA($P$116:$P$119,\"RETURN\",F$115,$C$5,,,,\"DECIMAL\",\"FALSE\",\"FALSE\")","v":-2.5460872761000002E-2},{"$f":"_xll.ECONOMATICA($P$116:$P$119,\"RETURN\",G$115,$C$5,,,,\"DECIMAL\",\"FALSE\",\"FALSE\")","v":7.7617710027000006E-2},{"$f":"_xll.ECONOMATICA($P$116:$P$119,\"RETURN\",H$115,$C$5,,,,\"DECIMAL\",\"FALSE\",\"FALSE\")","v":4.0374534252000001E-2},{"$f":"_xll.ECONOMATICA($P$116:$P$119,\"RETURN\",I$115,$C$5,,,,\"DECIMAL\",\"FALSE\",\"FALSE\")","v":0.13918894317},{"$f":"_xll.ECONOMATICA($P$116:$P$119,\"RETURN\",J$115,$C$5,,,,\"DECIMAL\",\"FALSE\",\"FALSE\")","v":0.18296179598000001},{"$f":"_xll.ECONOMATICA($P$116:$P$119,\"RETURN\",K$115,$C$5,,,,\"DECIMAL\",\"FALSE\",\"FALSE\")","v":0.16660174057999999},{"$f":"_xll.ECONOMATICA($P$116:$P$119,\"RETURN\",L$115,$C$5,,,,\"DECIMAL\",\"FALSE\",\"FALSE\")","v":0.36226100524999999},{"$f":"_xll.ECONOMATICA($P$116:$P$119,\"RETURN\",M$115,$C$5,,,,\"DECIMAL\",\"FALSE\",\"FALSE\")","v":0.27224953371999999},{"$f":"_xll.ECONOMATICA($P$116:$P$119,\"RETURN\",N$115,$C$5,,,,\"DECIMAL\",\"FALSE\",\"FALSE\")","v":1.0696875636000001},null,"IBOV"]
[null,"Dólar",-1.3418461204999999E-2,-3.2884268589000003E-2,0.12990312519,-1.0151457573999999E-2,1.2999999999999999E-2,9.6298374652000002E-2,0.1133907309,4.6787990125999997E-2,2.3711050809999999E-2,-1.8164195713E-2,0.31113827569000002,0.74867335848000005,null,"DOLOF"]
[null,"CDI ",4.0167597944999999E-4,6.7329904414000002E-3,7.8130739214000003E-2,8.7112432556999998E-3,2.6288345431999999E-2,5.2282893346000003E-2,0.11131296622,0.26088643925999999,0.39642699032000001,0.43749134680000001,0.48922019150000001,0.77232603664999999,null,"CDI Acumulado"]
[null,"SELIC",4.0167537918E-4,6.7329889971000003E-3,7.8130736396000003E-2,8.7112415130999998E-3,2.6288346664000001E-2,5.2282892135000002E-2,0.1113129631,0.26088643818000001,0.39642700660000002,0.43749135929999999,0.48922020531999999,0.77260159261000005,null,"LFT Acumulado"]
[]
[null,"Ibovespa"]
[]
[null,null,null,null,null,null,null,"Pontos",null,{"$f":"IFERROR(_xll.ECONOMATICA(\"ibov\",\"close\",,$C$5,,,,,\"false\",\"false\"),\"-\")","v":132155.76}]
[]
[null,null,null,null,null,null,null,{"$f":"\"Volume - \"&$C$7","v":"Volume - Millions"},null,{"$f":"IFERROR(_xll.ECONOMATICA(\"ibov\",\"volume$\",,$C$5,,,,$C$7,\"false\",\"false\"),\"-\")","v":19787.477360000001}]
[]
[null,null,null,null,null,null,null,"% Melhor Segmento",null,{"$f":"'Base Ibov'!$M$4","v":6.1777801601999999E-2},null,{"$f":"'Base Ibov'!$N$4","v":"Siderurgia"}]
[]
[null,null,null,null,null,null,null,"% Pior Segmento",null,{"$f":"'Base Ibov'!$M$5","v":-5.0373134329000001E-2},null,{"$f":"'Base Ibov'!N5","v":"Transporte aéreo"}]
[]
[null,null,null,null,null,null,null,"%Melhor e Pior Segmento é calculado pela méd. do desemp das ações que compoem o IBOV e seu respectivo seg."]
[]
[null,"Índices Inflação"]
[]
[null,null,{"$f":"EOMONTH($C$5,-1)","v":"2024-08-31"},{"$f":"EOMONTH($C$135,-1)","v":"2024-07-31"},{"$f":"EOMONTH(D135,-1)","v":"2024-06-30"},{"$f":"EOMONTH(E135,-1)","v":"2024-05-31"},"2024-04-30","2024-03-31","2024-02-29","2024-01-31","2023-12-31","2023-11-30","2023-10-31","2023-09-30",null,"CÓDIGOS ECONOMATICA"]
[null,"IGP-DI",{"$f":"_xll.ECONOMATICA($P$136:$P$141,\"RETURN\",\"mtd\",C$135,,,,\"DECIMAL\",\"FALSE\",\"FALSE\",,{\"tc.dft=false\";\"tc.tp=0\";\"tc.pers=5\";\"tc.per=0\"})","v":1.1596121385000001E-3},{"$f":"_xll.ECONOMATICA($P$136:$P$141,\"RETURN\",\"mtd\",D135,,,,\"DECIMAL\",\"FALSE\",\"FALSE\",,{\"tc.dft=false\";\"tc.tp=0\";\"tc.pers=5\";\"tc.per=0\"})","v":8.3325356263E-3},{"$f":"_xll.ECONOMATICA($P$136:$P$141,\"RETURN\",\"mtd\",E135,,,,\"DECIMAL\",\"FALSE\",\"FALSE\",,{\"tc.dft=false\";\"tc.tp=0\";\"tc.pers=5\";\"tc.per=0\"})","v":4.9691618878999998E-3},{"$f":"_xll.ECONOMATICA($P$136:$P$141,\"RETURN\",\"mtd\",F$135,,,,\"DECIMAL\",\"FALSE\",\"FALSE\",,{\"tc.dft=false\";\"tc.tp=0\";\"tc.pers=5\";\"tc.per=0\"})","v":8.7062195052999992E-3},{"$f":"_xll.ECONOMATICA($P$136:$P$141,\"RETURN\",\"mtd\",G$135,,,,\"DECIMAL\",\"FALSE\",\"FALSE\",,{\"tc.dft=false\";\"tc.tp=0\";\"tc.pers=5\";\"tc.per=0\"})","v":7.2134334095999997E-3},{"$f":"_xll.ECONOMATICA($P$136:$P$141,\"RETURN\",\"mtd\",H$135,,,,\"DECIMAL\",\"FALSE\",\"FALSE\",,{\"tc.dft=false\";\"tc.tp=0\";\"tc.pers=5\";\"tc.per=0\"})","v":-3.0343458447999998E-3},{"$f":"_xll.ECONOMATICA($P$136:$P$141,\"RETURN\",\"mtd\",I$135,,,,\"DECIMAL\",\"FALSE\",\"FALSE\",,{\"tc.dft=false\";\"tc.tp=0\";\"tc.pers=5\";\"tc.per=0\"})","v":-4.059602511E-3},{"$f":"_xll.ECONOMATICA($P$136:$P$141,\"RETURN\",\"mtd\",J$135,,,,\"DECIMAL\",\"FALSE\",\"FALSE\",,{\"tc.dft=false\";\"tc.tp=0\";\"tc.pers=5\";\"tc.per=0\"})","v":-2.6864675291999999E-3},{"$f":"_xll.ECONOMATICA($P$136:$P$141,\"RETURN\",\"mtd\",K$135,,,,\"DECIMAL\",\"FALSE\",\"FALSE\",,{\"tc.dft=false\";\"tc.tp=0\";\"tc.pers=5\";\"tc.per=0\"})","v":6.4279731978000004E-3},{"$f":"_xll.ECONOMATICA($P$136:$P$141,\"RETURN\",\"mtd\",L$135,,,,\"DECIMAL\",\"FALSE\",\"FALSE\",,{\"tc.dft=false\";\"tc.tp=0\";\"tc.pers=5\";\"tc.per=0\"})","v":5.0376312719999997E-3},{"$f":"_xll.ECONOMATICA($P$136:$P$141,\"RETURN\",\"mtd\",M$135,,,,\"DECIMAL\",\"FALSE\",\"FALSE\",,{\"tc.dft=false\";\"tc.tp=0\";\"tc.pers=5\";\"tc.per=0\"})","v":5.1084264668999997E-3},{"$f":"_xll.ECONOMATICA($P$136:$P$141,\"RETURN\",\"mtd\",N$135,,,,\"DECIMAL\",\"FALSE\",\"FALSE\",,{\"tc.dft=false\";\"tc.tp=0\";\"tc.pers=5\";\"tc.per=0\"})","v":4.4578156321000003E-3},null,"IGPDI<BraNa>"]
[null,"IGP-M",2.8531119642E-3,6.0752774734000002E-3,8.14028688E-3,8.9082414433999998E-3,3.0911165632000002E-3,-4.6681995008999999E-3,-5.1721118452000003E-3,7.1792554262999997E-4,7.3999722189999999E-3,5.9311093391000002E-3,4.9794335609000002E-3,3.6646024854999999E-3,null,"IGPM<BraNa>"]
[null,"INCC",6.9739004520999997E-3,7.2298934501000001E-3,7.1474416381999998E-3,8.6236561292E-3,5.1572547454000004E-3,2.7940348772999999E-3,1.3150057275000001E-3,2.6995934986E-3,3.0654773436000001E-3,6.8619367083999996E-4,1.9757805167E-3,3.4235524089999999E-3,null,"INCC-DI<BraNa>"]
[null,"INPC",-1.3999999217999999E-3,2.5999999324999999E-3,2.5000000096000001E-3,4.6000000675000003E-3,3.6999999993000002E-3,1.8999999046999999E-3,8.1000000555E-3,5.6999999288000003E-3,5.4999999992999997E-3,9.9999999474999993E-4,1.2000001170000001E-3,1.0999998867E-3,null,"INPC<BraNa>"]
[null,"IPC",1.8000000127000001E-3,6.000000194E-4,2.6000000307000001E-3,8.9999998454000005E-4,3.2999999893999999E-3,2.5999999979999999E-3,4.6000000602000003E-3,4.5999999310999996E-3,3.8000000750000001E-3,4.2999998695000003E-3,3.0000001116000001E-3,2.8999999576999999E-3,null,"IPC<BraNa>"]
[null,"IPCA",-2.0000009226E-4,3.8000002695999999E-3,2.0999999032999999E-3,4.5999999347000001E-3,3.7999994128999999E-3,1.6000005689000001E-3,8.3000001158999998E-3,4.1999998521000002E-3,5.6000002186999999E-3,2.7999997274000001E-3,2.4000000994000002E-3,2.5999999125E-3,null,"IPCA<BraNa>"]
[]
[null,"Comparativo Índices",null,null,null,null,null,null,null,null,null,null,"Selecionar um Período (D = Dias; W = Semanas; M = Mês; Q = Trimestre; Y = Anos) →","1Y"]
[]
[null,"Gráfico Base 100",null,null,null,null,null,"Risco x Retorno"]
[]
[]
[]
[]
[]
[]
[]
[]
[]
[]
[]
[]
[]
[]
[]
[]
[]
[null,"Comparativo Peers"]
[]
[null,{"$f":"_xll.ECONOMATICA($P$166:$P$170,\"name\")","v":{"$error":"#VALUE!"}},"No Dia","No Mês","No Ano","1M","3M","6M","12M","24M","36M","48M","60M","90M",null,"CÓDIGOS ECONOMATICA"]
[null,"Gerdau",{"$f":"_xll.ECONOMATICA($P$166:$P$170,\"RETURN\",\"1D\",$C$5,,,,\"DECIMAL\",\"FALSE\",\"FALSE\")","v":{"$error":"#VALUE!"}},{"$f":"_xll.ECONOMATICA($P$166:$P$170,\"RETURN\",\"MTD\",$C$5,,,,\"DECIMAL\",\"FALSE\",\"FALSE\")","v":{"$error":"#VALUE!"}},{"$f":"_xll.ECONOMATICA($P$166:$P$170,\"RETURN\",\"YTD\",$C$5,,,,\"DECIMAL\",\"FALSE\",\"FALSE\")","v":{"$error":"#VALUE!"}},{"$f":"_xll.ECONOMATICA($P$166:$P$170,\"RETURN\",F$115,$C$5,,,,\"DECIMAL\",\"FALSE\",\"FALSE\")","v":{"$error":"#VALUE!"}},{"$f":"_xll.ECONOMATICA($P$166:$P$170,\"RETURN\",G$115,$C$5,,,,\"DECIMAL\",\"FALSE\",\"FALSE\")","v":{"$error":"#VALUE!"}},{"$f":"_xll.ECONOMATICA($P$166:$P$170,\"RETURN\",H$115,$C$5,,,,\"DECIMAL\",\"FALSE\",\"FALSE\")","v":{"$error":"#VALUE!"}},{"$f":"_xll.ECONOMATICA($P$166:$P$170,\"RETURN\",I$115,$C$5,,,,\"DECIMAL\",\"FALSE\",\"FALSE\")","v":{"$error":"#VALUE!"}},{"$f":"_xll.ECONOMATICA($P$166:$P$170,\"RETURN\",J$115,$C$5,,,,\"DECIMAL\",\"FALSE\",\"FALSE\")","v":{"$error":"#VALUE!"}},{"$f":"_xll.ECONOMATICA($P$166:$P$170,\"RETURN\",K$115,$C$5,,,,\"DECIMAL\",\"FALSE\",\"FALSE\")","v":{"$error":"#VALUE!"}},{"$f":"_xll.ECONOMATICA($P$166:$P$170,\"RETURN\",L$115,$C$5,,,,\"DECIMAL\",\"FALSE\",\"FALSE\")","v":{"$error":"#VALUE!"}},{"$f":"_xll.ECONOMATICA($P$166:$P$170,\"RETURN\",M$115,$C$5,,,,\"DECIMAL\",\"FALSE\",\"FALSE\")","v":{"$error":"#VALUE!"}},{"$f":"_xll.ECONOMATICA($P$166:$P$170,\"RETURN\",N$115,$C$5,,,,\"DECIMAL\",\"FALSE\",\"FALSE\")","v":{"$error":"#VALUE!"}},null,{"$f":"IF($C$3='Base Ibov'!U7,$C$3,'Base Ibov'!U7)","v":{"$error":"#VALUE!"}}]
[null,"Sid Nacional",9.3862815884E-2,2.192242833E-2,-0.35002066614999999,-1.0612244898000001E-2,-4.6420141621999998E-2,-0.19479560785,0.10660243414999999,0.34542173363000001,-0.38058970320000002,0.18403511183999999,0.37882164490999998,1.0519962241,null,{"$f":"IF($C$3='Base Ibov'!U8,$C$3,'Base Ibov'!U8)","v":"CSNA3"}]
[null,"Gerdau Met",3.4749034748999999E-2,2.1925643469999999E-2,1.6622109735000001E-2,1.6113744074999999E-2,3.8933739528E-2,9.1085577712999993E-2,6.5275242780000006E-2,0.25591729348999998,0.34790900312,0.88539610865999996,1.8099062846,2.6767216142999999,null,{"$f":"IF($C$3='Base Ibov'!U9,$C$3,'Base Ibov'!U9)","v":"GOAU4"}]
[null,"Usiminas",7.6785714286000006E-2,-3.2102728732999998E-2,-0.32852797769999997,-8.3586626139999995E-2,-0.21586475943,-0.38542117368000001,-5.3418044443000003E-2,-0.14060987545,-0.57149542442000001,-0.28221363357000001,-4.6267743846999998E-2,0.90029213651999995,null,{"$f":"IF($C$3='Base Ibov'!U10,$C$3,'Base Ibov'!U10)","v":"USIM5"}]
[null,"Ferbasa",4.4386422975999998E-2,-1.1660010518000001E-2,-0.30220169628999999,-3.5332824637999999E-2,2.4805459831E-2,-6.7797610933999997E-2,-0.31480876566999999,-0.30839176558999998,-0.30706200040999998,1.3071235266000001,1.3669450552,3.9820555493000001,null,{"$f":"IF($C$3='Base Ibov'!U11,$C$3,'Base Ibov'!U11)","v":"FESA4"}]
[]
[null,null,null,null,null,null,null,null,null,null,null,null,"Selecionar um Período (D = Dias; W = Semanas; M = Mês; Q = Trimestre; Y = Anos) →","1Y"]
[null,"Gráfico Base 100",null,null,null,null,null,"Risco x Retorno"]
[]
[]
[]
[]
[]
[]
[]
[]
[]
[]
[]
[]
[]
[]
[]
[]
[]
[null,"Taxa Média de Aluguel",null,null,null,null,null,null,null,null,null,null,"Selecionar um Período (D = Dias; W = Semanas; M = Mês; Q = Trimestre; Y = Anos) →","12M"]

{"sheet":"Base Auxiliar","index":1,"n_rows":607,"n_cols":48,"rows_kept":607,"cut":false,"hidden":false,"merged":[[2,12,2,16],[5,13,5,16],[2,43,2,44],[2,46,2,47],[2,5,2,10],[9,1,9,3],[2,1,2,2],[5,37,5,41],[4,37,4,41],[3,37,3,41],[2,32,5,34],[2,36,2,41],[2,27,5,30],[3,13,3,16],[4,13,4,16],[2,18,5,25]]}
[null,null,null,null,null,"Planilha Auxiliar Não Modificar"]
[]
[null,"Referências",null,null,null,"FECHAMENTO e VOLUME",null,null,null,null,null,null,"BASE 100",null,null,null,null,null,"ATIVO X PASSIVO",null,null,null,null,null,null,null,null,"RISCO X RETORNO",null,null,null,null,"RISCO X RETORNO PEERS",null,null,null,"RETORNO PEERS",null,null,null,null,null,null,"RETORNO PEERS",null,null,"RETORNO PEERS"]
[null,"Ticker",{"$f":"'Lâmina De RI'!C$3","v":"GGBR4"},null,null,null,null,null,null,null,null,null,"Máx ",{"$f":"ROUNDUP(MAX($N$11:$Q$1013),0)+5","v":124},null,null,null,null,null,null,null,null,null,null,null,null,null,null,null,null,null,null,null,null,null,null,"Máx ",{"$f":"ROUNDUP(MAX($AL$10:$AP$1013),0)+5","v":176},null,null,null,null,null,"Máx ",{"$f":"ROUNDUP(MAX($AS$12:$AS$1013),0)+1","v":3},null,"Máx ",{"$f":"ROUNDUP(MAX($AV$12:$AV$1013),0)+5000","v":141005}]
[null,"Data Fim",{"$f":"'Lâmina De RI'!C$5","v":"2024-09-24"},null,null,null,null,null,null,null,null,null,"Mín",{"$f":"ROUNDUP(MIN($N$11:$Q$1013),0)-5","v":82},null,null,null,null,null,null,null,null,null,null,null,null,null,null,null,null,null,null,null,null,null,null,"Mín",{"$f":"ROUNDUP(MIN($AL$12:$AP$1013),0)-5","v":82},null,null,null,null,null,"Mín",{"$f":"ROUNDDOWN(MIN($AS$12:$AS$1013),0)","v":0},null,"Mín",{"$f":"ROUNDDOWN(MIN($AV$12:$AV$1013),0)-5000","v":108155}]
[null,"UNIDADES",{"$f":"'Lâmina De RI'!$C$7","v":"Millions"},null,null,null,null,null,null,null,null,null,"VBA",{"$f":"AtualizarLimitesGrafico(\"RI\",\"BASE100\",$N$5,$N$4)","v":{"$error":"#VALUE!"}},null,null,null,null,null,null,null,null,null,null,null,null,null,null,null,null,null,null,null,null,null,null,"VBA",{"$f":"AtualizarLimitesGrafico(\"RI\",\"BASE100PEERS\",$AL$5,$AL$4)","v":{"$error":"#VALUE!"}},null,null,null,null,null,"VBA",{"$f":"AtualizarLimitesGrafico(\"RI\",\"TXALUGUEL\",$AS$5,$AS$4)","v":{"$error":"#VALUE!"}},null,"VBA",{"$f":"AtualizarLimitesGrafico(\"RI\",\"IBOV\",$AV$5,$AV$4)","v":{"$error":"#VALUE!"}}]
[null,"INTERVALO","W",null,null,null,null,null,null,null,null,null,null,null,null,null,null,null,null,null,null,null,null,null,null,null,null,null,null,null,null,null,null,null,null,null,{"$f":"'Lâmina De RI'!$N$172","v":"1Y"},null,null,null,null,null,null,{"$f":"'Lâmina De RI'!$N$191","v":"12M"},null,null,{"$f":"'Lâmina De RI'!$N$191","v":"12M"}]
[null,null,null,null,null,{"$f":"'Lâmina De RI'!N$11","v":"36M"},null,null,null,"Data Inicio",{"$f":"F11-100","v":"2021-06-16"},null,{"$f":"'Lâmina De RI'!$N$143","v":"1Y"},null,"IBOV","CDI Acumulado","DOLOF",null,"5Y",null,null,null,null,null,null,null,null,{"$f":"'Lâmina De RI'!$N$143","v":"1Y"},null,null,null,null,{"$f":"AK7","v":"1Y"},null,null,null,null,{"$f":"TRANSPOSE($AG$10:$AG$14)","v":{"$error":"#VALUE!"}},"CSNA3","GOAU4","USIM5",0,null,null,{"$f":"$C$4","v":"GGBR4"},null,null,"IBOV"]
[null,null,null,null,null,{"$f":"_xll.ECONOMATICA($C$4,\"close\",,$C$5,$F$8,$C$7,,,\"true\",\"true\",\"Fechamento\")","v":{"$error":"#VALUE!"}},"Fechamento",{"$f":"_xll.ECONOMATICA($C$4,\"Volume$\",,$C$5,$F$8,$C$7,,$C$6,\"FALSE\",\"true\",\"Volume\")","v":{"$error":"#VALUE!"}},"Volume Médio 3M",{"$f":"_xll.ECONOMATICA($C$4,\"Hist Average\",\"3M\",$C$5,$K$8,$C$7,\"ORIGINAL CURRENCY\",$C$6,\"true\",\"true\",\"Volume Médio 3M\",{\"std.tec.cals=7\"})","v":{"$error":"#VALUE!"}},"Volume Médio 3M",null,{"$f":"_xll.ECONOMATICA($C$4,\"close\",,$C$5,$M$8,\"d\",\"REBASED TO 100\",,\"true\",\"true\",\"Fechamento\")","v":{"$error":"#VALUE!"}},"Fechamento",{"$f":"_xll.ECONOMATICA(O8,\"close\",,$C$5,$M$8,\"d\",\"REBASED TO 100\",,\"FALSE\",\"true\",\"Fechamento\")","v":{"$error":"#VALUE!"}},{"$f":"_xll.ECONOMATICA(P8,\"close\",,$C$5,$M$8,\"d\",\"REBASED TO 100\",,\"FALSE\",\"true\",\"Fechamento\")","v":{"$error":"#VALUE!"}},{"$f":"_xll.ECONOMATICA(Q8,\"close\",,$C$5,$M$8,\"d\",\"REBASED TO 100\",,\"FALSE\",\"true\",\"Fechamento\")","v":{"$error":"#VALUE!"}},null,{"$f":"_xll.ECONOMATICA($C$4,\"Total Assets\",,$C$5,$S$8,\"Y\",,$C$6,\"true\",\"true\",\"ATIVO TOTAL\")","v":{"$error":"#VALUE!"}},"ATIVO TOTAL","PASSIVO TOTAL",{"$f":"_xll.ECONOMATICA($C$4,\"Stock Eq Par\",,$C$5,$S$8,\"Y\",,$C$6,\"FALSE\",\"true\",\"Patrimonio Liquido\")","v":{"$error":"#VALUE!"}},{"$f":"_xll.ECONOMATICA($C$4,\"Curr Assets\",,$C$5,$S$8,\"Y\",,$C$6,\"FALSE\",\"true\",\"Ativo Circulante\")","v":{"$error":"#VALUE!"}},{"$f":"_xll.ECONOMATICA($C$4,\"Non Curr Assets\",,$C$5,$S$8,\"Y\",,$C$6,\"FALSE\",\"true\",\"Ativo Não Circulante\")","v":{"$error":"#VALUE!"}},{"$f":"_xll.ECONOMATICA($C$4,\"Curr Liab\",,$C$5,$S$8,\"Y\",,$C$6,\"FALSE\",\"true\",\"Passivo Circulante\")","v":{"$error":"#VALUE!"}},{"$f":"_xll.ECONOMATICA($C$4,\"NCurLiab\",,$C$5,$S$8,\"Y\",,$C$6,\"FALSE\",\"true\",\"Passivo Não Circulante\")","v":{"$error":"#VALUE!"}},null,null,{"$f":"_xll.ECONOMATICA($AB$10:$AB$13,\"name\")","v":{"$error":"#VALUE!"}},{"$f":"_xll.ECONOMATICA($AB$10:$AB$13,\"risk\",$AB$8,$C$5,,,,,,\"true\",\"RISCO\")","v":{"$error":"#VALUE!"}},{"$f":"_xll.ECONOMATICA($AB$10:$AB$13,\"RETURN\",$AB$8,$C$5,,,,,,\"true\",\"RETORNO\")","v":{"$error":"#VALUE!"}},null,null,{"$f":"_xll.ECONOMATICA($AG$10:$AG$14,\"risk\",\"12m\",$C$5,,,,,,\"true\",\"RISCO\")","v":{"$error":"#VALUE!"}},{"$f":"_xll.ECONOMATICA($AG$10:$AG$14,\"RETURN\",\"12m\",$C$5,,,,,,\"true\",\"RETORNO\")","v":{"$error":"#VALUE!"}},null,{"$f":"_xll.ECONOMATICA(AL$8,\"CLOSE\",,$C$5,\"12M\",\"D\",\"REBASED TO 100\",,\"TRUE\",\"TRUE\",\"RETORNO\")","v":{"$error":"#VALUE!"}},"RETORNO",{"$f":"IF(AM8=\"\",\"\",_xll.ECONOMATICA(AM8,\"CLOSE\",,$C$5,\"12M\",\"D\",\"REBASED TO 100\",,\"FALSE\",\"TRUE\",\"RETORNO\"))","v":{"$error":"#VALUE!"}},{"$f":"IF(AN8=\"\",\"\",_xll.ECONOMATICA(AN8,\"CLOSE\",,$C$5,\"12M\",\"D\",\"REBASED TO 100\",,\"FALSE\",\"TRUE\",\"RETORNO\"))","v":{"$error":"#VALUE!"}},{"$f":"IF(AO8=\"\",\"\",_xll.ECONOMATICA(AO8,\"CLOSE\",,$C$5,\"12M\",\"D\",\"REBASED TO 100\",,\"FALSE\",\"TRUE\",\"RETORNO\"))","v":{"$error":"#VALUE!"}},{"$f":"IF(AP8=\"\",\"\",_xll.ECONOMATICA(AP8,\"CLOSE\",,$C$5,\"12M\",\"D\",\"REBASED TO 100\",,\"FALSE\",\"TRUE\",\"RETORNO\"))","v":{"$error":"#VALUE!"}},null,{"$f":"_xll.ECONOMATICA(AS$8,\"AvgFeeLndr-inPer\",,'Base Auxiliar'!$C$5,'Lâmina De RI'!$N$191,\"D\",,,\"TRUE\",\"TRUE\",\"TX ALUGUEL (MÉDIA - BALCÃO)\")","v":{"$error":"#VALUE!"}},"TX ALUGUEL (MÉDIA - BALCÃO)",null,{"$f":"_xll.ECONOMATICA(\"ibov\",\"close\",,'Base Auxiliar'!$C$5,'Lâmina De RI'!$N$191,\"W\",,,\"TRUE\",\"TRUE\",\"PONTOS IBOV\")","v":{"$error":"#VALUE!"}},"PONTOS IBOV"]
[null,"Acionistas",null,null,null,null,"GGBR4","GGBR4",null,null,"GGBR4",null,null,"GGBR4","IBOV","CDI Acumulado","DOLOF",null,null,"GGBR4",{"$f":"$T$10","v":"GGBR4"},"GGBR4","GGBR4","GGBR4","GGBR4","GGBR4",null,{"$f":"$C$4","v":"GGBR4"},"Gerdau",26.015297664999999,-4.3911566261999999,null,{"$f":"'Lâmina De RI'!P166","v":{"$error":"#VALUE!"}},26.015297664999999,-4.3911566261999999,null,null,"GGBR4","CSNA3","GOAU4","USIM5",0,null,null,"GGBR4",null,null,"IBOV"]
[null,"Posição","Opcional 1 (Nome)","Opcional 2 (%)",null,"2021-09-24",15.610408511999999,2630.0549460000002,{"$f":"IFERROR(VLOOKUP(F11,$J$11:$K$607,2,0),NA())","v":1948.7526356000001},"2021-06-18",null,null,"2023-09-22",100,100,100,100,null,"2019-12-31",54002.97,{"$f":"IF(S11=\"\",\"\",IF(T11=\"\",NA(),T11-V11))","v":27047.269},26955.701000000001,18235.713,35767.256999999998,7424.5370000000003,19405.306,null,"IBOV ","Ibovespa",12.757977131000001,13.918894315999999,null,{"$f":"'Lâmina De RI'!P167","v":"CSNA3"},35.991833151000002,10.660243415]
[null,{"$f":"'Lâmina De RI'!B58","v":1},{"$f":"\"std.cac.en=\"&B12","v":"std.cac.en=1"},{"$f":"\"std.cac.ccacq=2\"&\";\"&\"std.cac.fam=1\"&\";\"&\"std.cac.nm=\"&B12","v":"std.cac.ccacq=2;std.cac.fam=1;std.cac.nm=1"},null,"2021-10-01",16.478082370999999,2604.7351370000001,1964.9382934,"2021-06-25",null,null,"2023-09-25",100.57708160999999,99.927565740000006,100.04727926,100.96680302999999,null,"2020-12-31",63123.008999999998,{"$f":"IF(S12=\"\",\"\",IF(T12=\"\",NA(),T12-V12))","v":32262.737999999998},30860.271000000001,23409.453000000001,39713.555999999997,11482.143,20555.655999999999,null,"DOLOF","Dolar Ptax Venda",10.812452304000001,11.339073089999999,null,{"$f":"'Lâmina De RI'!P168","v":"GOAU4"},23.751680965999999,6.5275242779999996,null,"2023-09-22",100,100,100,100,null,null,"2023-09-22",1.52,null,"2023-09-22",116008.64]
[null,{"$f":"'Lâmina De RI'!B59","v":2},{"$f":"\"std.cac.en=\"&B13","v":"std.cac.en=2"},{"$f":"\"std.cac.ccacq=2\"&\";\"&\"std.cac.fam=1\"&\";\"&\"std.cac.nm=\"&B13","v":"std.cac.ccacq=2;std.cac.fam=1;std.cac.nm=2"},null,"2021-10-08",16.168746528,1583.235813,1988.4967185,"2021-07-02",null,null,"2023-09-26",100.70074196,98.435280337999998,100.0945808,101.19272964,null,"2021-12-31",73814.612999999998,31210.330999999998,42604.281999999999,32640.476999999999,41174.135999999999,14036.814,16962.150000000001,null,"CDI Acumulado","CDI",4.4944101558000001E-2,11.131296622000001,null,{"$f":"'Lâmina De RI'!P169","v":"USIM5"},43.026495603000001,-5.3418044443000001,null,"2023-09-25",100.57708160999999,99.586776858999997,100.44563279,98.634294385999993,null,null,"2023-09-25",1.52,null,"2023-09-29",116565.17]
[null,{"$f":"'Lâmina De RI'!B60","v":3},"std.cac.en=3","std.cac.ccacq=2;std.cac.fam=1;std.cac.nm=3",null,"2021-10-15",16.757674382000001,1566.7050429999999,1938.8516996999999,"2021-07-09",null,null,"2023-09-27",100.78318219000001,98.550461413999997,100.14190474999999,102.35696403,null,"2022-12-31",73798.652000000002,27682.457999999999,46116.194000000003,31257.421999999999,42541.23,13462.581,14037.878000000001,null,null,null,null,null,null,null,null,null,null,"2023-09-26",100.70074196,99.173553718999997,99.643493761000002,98.179059181,null,null,"2023-09-26",1.52,null,"2023-10-06",114169.63]
[null,{"$f":"'Lâmina De RI'!B61","v":4},"std.cac.en=4","std.cac.ccacq=2;std.cac.fam=1;std.cac.nm=4",null,"2021-10-22",15.901052049,1848.4484689999999,1950.1466513,"2021-07-16",null,null,"2023-09-28",100.16488046000001,99.760466117000007,100.18925110000001,102.73554375000001,null,"2023-12-31",74885.144,25826.184999999998,49058.959000000003,29197.937000000002,45687.207000000002,11284.611999999999,14361.669,null,null,null,null,null,null,null,null,null,null,"2023-09-27",100.78318219000001,98.595041322,100.53475935,98.937784522000001,null,null,"2023-09-27",1.43,null,"2023-10-13",115754.08]
[null,{"$f":"'Lâmina De RI'!B62","v":5},"std.cac.en=5","std.cac.ccacq=2;std.cac.fam=1;std.cac.nm=5",null,"2021-10-29",16.002181074999999,2332.344983,1988.2100170000001,"2021-07-23",null,null,"2023-09-29",99.464138500000004,100.47973150999999,100.23661986,101.92342918999999,null,"2024-12-31",82399.263999999996,27268.954999999994,55130.309000000001,31828.12,50571.144,11246.915000000001,15810.442999999999,null,null,null,null,null,null,null,null,null,null,"2023-09-28",100.16488046000001,99.421487603000003,100.26737967,99.848254932000003,null,null,"2023-09-28",1.35,null,"2023-10-20",113155.28]
[null,{"$f":"'Lâmina De RI'!B63","v":6},"std.cac.en=6","std.cac.ccacq=2;std.cac.fam=1;std.cac.nm=6",null,"2021-11-05",14.580425953000001,1477.5213799999999,1923.5222991000001,"2021-07-30",null,null,"2023-10-02",98.021434459999995,99.179561109000005,100.28401089,103.15076021,null,null,null,"",null,null,null,null,null,null,null,null,null,null,null,null,null,null,null,"2023-09-29",99.464138500000004,100.33057851,99.376114082000001,100.75872534,null,null,"2023-09-29",1.35,null,"2023-10-27",113301.35]
[null,{"$f":"'Lâmina De RI'!B64","v":7},"std.cac.en=7","std.cac.ccacq=2;std.cac.fam=1;std.cac.nm=7",null,"2021-11-12",16.179240682,1887.7236350000001,1933.3932219999999,"2021-08-06",null,null,"2023-10-03",96.001648805000002,97.767752470999994,100.33142433,104.007653,null,null,null,"",null,null,null,null,null,null,null,null,null,null,null,null,null,null,null,"2023-10-02",98.021434459999995,99.338842975000006,98.484848485000001,99.696509863000003,null,null,"2023-10-02",1.29,null,"2023-11-03",118159.97]
[null,{"$f":"'Lâmina De RI'!B65","v":8},"std.cac.en=8","std.cac.ccacq=2;std.cac.fam=1;std.cac.nm=8",null,"2021-11-19",15.790684113999999,1161.5307969999999,1840.9105523000001,"2021-08-13",null,null,"2023-10-04",94.806265457999999,97.930162788000004,100.3788603,104.87472268,null,null,null,"",null,null,null,null,null,null,null,null,null,null,null,null,null,null,null,"2023-10-03",96.001648805000002,97.520661157000006,96.256684492000005,98.482549316999993,null,null,"2023-10-03",1.29,null,"2023-11-10",120568.14]
[null,{"$f":"'Lâmina De RI'!B66","v":9},"std.cac.en=9","std.cac.ccacq=2;std.cac.fam=1;std.cac.nm=9",null,"2021-11-26",16.274787378999999,1515.3706529999999,1832.5512831000001,"2021-08-20",null,null,"2023-10-05",93.446001648999996,97.651416307999995,100.42631867999999,105.25533777,null,null,null,"",null,null,null,null,null,null,null,null,null,null,null,null,null,null,null,"2023-10-04",94.806265457999999,95.537190082999999,95.008912656000007,97.420333838999994,null,null,"2023-10-04",1.34,null,"2023-11-17",124773.21]
[null,{"$f":"'Lâmina De RI'!B67","v":10},"std.cac.en=10","std.cac.ccacq=2;std.cac.fam=1;std.cac.nm=10",null,"2021-12-03",17.739836732000001,2074.6111500000002,1877.2167723,"2021-08-27",null,null,"2023-10-06",93.446001648999996,98.414764624,100.47379946,105.67258959999999,null,null,null,"",null,null,null,null,null,null,null,null,null,null,null,null,null,null,null,"2023-10-05",93.446001648999996,94.710743801999996,93.850267380000005,96.206373292999999,null,null,"2023-10-05",1.33,null,"2023-11-24",125517.27]
[null,null,null,null,null,"2021-12-10",18.848178417,1584.2042240000001,1898.6392860000001,"2021-09-03",null,null,"2023-10-09",92.868920032999995,99.265080600999994,100.52130265,105.15967515,null,null,null,"",null,null,null,null,null,null,null,null,null,null,null,null,null,null,null,"2023-10-06",93.446001648999996,95.123966941999996,93.672014259999997,96.054628225000002,null,null,"2023-10-06",1.26,null,"2023-12-01",128184.91]
[null,null,null,null,null,"2021-12-17",18.478731188000001,1764.521489,1848.5390553,"2021-09-10",null,null,"2023-10-10",93.116240726000001,100.62780668000001,100.56882837000001,103.5232338,null,null,null,"",null,null,null,null,null,null,null,null,null,null,null,null,null,null,null,"2023-10-09",92.868920032999995,94.214876032999996,93.226381462000006,94.992412747000003,null,null,"2023-10-09",1.18,null,"2023-12-08",127093.57]
[null,null,null,null,null,"2021-12-24",17.166556549999999,1139.6619250000001,1733.8934383000001,"2021-09-17",1907.8773068,null,"2023-10-11",92.827699917000004,100.89829516,100.61637648999999,102.77828662,null,null,null,"",null,null,null,null,null,null,null,null,null,null,null,null,null,null,null,"2023-10-10",93.116240726000001,96.033057850999995,93.582887700000001,95.599393019999994,null,null,"2023-10-10",1.08,null,"2023-12-15",130197.1]
[null,"Nome","Índices",null,null,"2021-12-31",17.364019723999998,608.89331500000003,1580.3671443000001,"2021-09-24",1948.7526356000001,null,"2023-10-12",null,null,null,null,null,null,null,"",null,null,null,null,null,null,null,null,null,null,null,null,null,null,null,"2023-10-11",92.827699917000004,97.272727273000001,93.761140819999994,96.206373292999999,null,null,"2023-10-11",1.04,null,"2023-12-22",132752.93]
[null,"Ibovespa","IBOV",null,null,"2022-01-07",17.472305981000002,1407.886524,1566.8787374999999,"2021-10-01",1964.9382934,null,"2023-10-13",92.044517725000006,99.780568067999994,100.66394715,103.04084997,null,null,null,"",null,null,null,null,null,null,null,null,null,null,null,null,null,null,null,"2023-10-12",null,null,null,null,null,null,"2023-10-12",null,null,"2023-12-29",134185.24]
[null,"Ibrasil","IBRA<XBSP>",null,null,"2022-01-14",18.013737262999999,1365.9270799999999,1551.4342787999999,"2021-10-08",1988.4967185,null,"2023-10-16",92.910140147999996,100.45273352,100.71154033000001,103.02660234,null,null,null,"",null,null,null,null,null,null,null,null,null,null,null,null,null,null,null,"2023-10-13",92.044517725000006,96.198347107000004,92.602495544000007,94.992412747000003,null,null,"2023-10-13",0.98,null,"2024-01-05",132022.92000000001]
[null,"Ibrx Brasil","IBXX<XBSP>",null,null,"2022-01-21",17.491415320000002,1280.77719,1507.7672573,"2021-10-15",1938.8516996999999,null,"2023-10-17",92.044517725000006,99.913618502999995,100.75915593000001,102.55032464,null,null,null,"",null,null,null,null,null,null,null,null,null,null,null,null,null,null,null,"2023-10-16",92.910140147999996,96.363636364000001,93.672014259999997,95.144157815,null,null,"2023-10-16",0.98,null,"2024-01-12",130987.67]
[null,"Ibrx 50","IBXL<XBSP>",null,null,"2022-01-28",17.879971888,1550.6283169999999,1447.6352061,"2021-10-22",1950.1466513,null,"2023-10-18",89.282769991999999,98.319952721000007,100.80679404999999,102.9248336,null,null,null,"",null,null,null,null,null,null,null,null,null,null,null,null,null,null,null,"2023-10-17",92.044517725000006,96.280991736000004,92.869875222999994,94.081942337000001,null,null,"2023-10-17",0.98,null,"2024-01-19",127635.65]
[null,"Ico2","ICO2<XBSP>",null,null,"2022-02-04",18.332226253000002,1132.297413,1421.0795163,"2021-10-29",1988.2100170000001,null,"2023-10-19",89.159109645000001,98.272249376999994,100.85445471,102.86784311,null,null,null,"",null,null,null,null,null,null,null,null,null,null,null,null,null,null,null,"2023-10-18",89.282769991999999,93.388429751999993,90.017825311999999,93.778452200000004,null,null,"2023-10-18",0.98,null,"2024-01-26",128967.32]
[null,"Iconsumo","ICON<XBSP>",null,null,"2022-02-11",17.892711447,1940.0516789999999,1425.1047504999999,"2021-11-05",1923.5222991000001,null,"2023-10-20",88.417147568000004,97.540390095000006,100.9021379,102.84341861,null,null,null,"",null,null,null,null,null,null,null,null,null,null,null,null,null,null,null,"2023-10-19",89.159109645000001,92.975206611000004,90.463458110000005,92.564491653999994,null,null,"2023-10-19",0.98,null,"2024-02-02",127182.25]
[null,"I Dividendos","IDIV<XBSP>",null,null,"2022-02-18",16.268417598999999,1448.2989669999999,1447.1638405000001,"2021-11-12",1933.3932219999999,null,"2023-10-23",89.694971146,97.220793209999997,100.94984362,102.10254218,null,null,null,"",null,null,null,null,null,null,null,null,null,null,null,null,null,null,null,"2023-10-20",88.417147568000004,89.917355372000003,89.393939394,90.28831563,null,null,"2023-10-20",0.98,null,"2024-02-09",128025.7]
[null,"Ieeletrica","IEEX<XBSP>",null,null,"2022-02-25",16.217459361,2102.437226,1492.3228076,"2021-11-19",1840.9105523000001,null,"2023-10-24",88.829348722000006,98.063299423000004,100.99757187,101.90104006999999,null,null,null,"",null,null,null,null,null,null,null,null,null,null,null,null,null,null,null,"2023-10-23",89.694971146,90.495867769,90.998217468999997,89.984825493000002,null,null,"2023-10-23",0.98,null,"2024-02-16",128725.88]
[null,"Ifinanceiro","IFNC<XBSP>",null,null,"2022-03-04",18.7271526,1799.504563,1471.1607624999999,"2021-11-26",1832.5512831000001,null,"2023-10-25",88.499587798999997,97.259971325999999,101.04532279,101.73006859,null,null,null,"",null,null,null,null,null,null,null,null,null,null,null,null,null,null,null,"2023-10-24",88.829348722000006,91.983471073999993,90.017825311999999,90.591805765999993,null,null,"2023-10-24",0.97,null,"2024-02-23",129418.73]
[null,"Igovernanca","IGCX<XBSP>",null,null,"2022-03-11",19.383757588999998,2282.99881,1524.9141921999999,"2021-12-03",1877.2167723,null,"2023-10-26",89.901071723000001,98.938199776000005,101.09309623,101.88068632,null,null,null,"",null,null,null,null,null,null,null,null,null,null,null,null,null,null,null,"2023-10-25",88.499587798999997,91.239669421000002,89.750445632999998,89.074355084000004,null,null,"2023-10-25",0.97,null,"2024-03-01",129180.37]
[null,"Igc - Nm","IGNM<XBSP>",null,null,"2022-03-18",19.556941392999999,2522.9023929999998,1583.2511847999999,"2021-12-10",1898.6392860000001,null,"2023-10-27",90.024732068999995,97.666303131000006,101.14089221,100.71034581000001,null,null,null,"",null,null,null,null,null,null,null,null,null,null,null,null,null,null,null,"2023-10-26",89.901071723000001,93.305785123999996,91.265597147999998,90.743550834999994,null,null,"2023-10-26",0.97,null,"2024-03-08",127070.79]
[null,"Igc Trade","IGCT<XBSP>",null,null,"2022-03-25",19.614669327000001,2209.428926,1665.5409540999999,"2021-12-17",1848.5390553,null,"2023-10-30",90.189612530999995,97.002706004999993,101.18871085000001,101.91935845,null,null,null,"",null,null,null,null,null,null,null,null,null,null,null,null,null,null,null,"2023-10-27",90.024732068999995,93.966942149000005,91.265597147999998,94.537177541999995,null,null,"2023-10-27",0.96,null,"2024-03-15",126741.81]
[null,"Imat Basicos","IMAT<XBSP>",null,null,"2022-04-01",19.653154616999998,1871.660633,1762.6769016000001,"2021-12-24",1733.8934383000001,null,"2023-10-31",89.736191261000002,97.530382220000007,101.23655214,102.93908123,null,null,null,"",null,null,null,null,null,null,null,null,null,null,null,null,null,null,null,"2023-10-30",90.189612530999995,95.041322313999999,91.711229946000003,98.786039454000004,null,null,"2023-10-30",0.96,null,"2024-03-22",127027.1]
[null,"Imobiliario","IMOB<XBSP>",null,null,"2022-04-08",18.851377748000001,1759.0007740000001,1789.6856901000001,"2021-12-31",1580.3671443000001,null,"2023-11-01",91.426215993,99.17619929,101.28441597,102.16360342,null,null,null,"",null,null,null,null,null,null,null,null,null,null,null,null,null,null,null,"2023-10-31",89.736191261000002,97.190082644,92.067736185000001,100.30349013,null,null,"2023-10-31",0.96,null,"2024-03-29",128106.1]
[null,"Industrial","INDX<XBSP>",null,null,"2022-04-15",18.870620392999999,855.69277699999998,1750.4368975,"2022-01-07",1566.8787374999999,null,"2023-11-02",null,null,null,null,null,null,null,"",null,null,null,null,null,null,null,null,null,null,null,null,null,null,null,"2023-11-01",91.426215993,98.925619835000006,93.672014259999997,102.27617601999999,null,null,"2023-11-01",1,null,"2024-04-05",126795.41]
[null,"Isustentabil","ISEE<XBSP>",null,null,"2022-04-22",18.132985673,1363.875855,1756.8291025000001,"2022-01-14",1551.4342787999999,null,"2023-11-03",94.187963726000007,101.8544567,101.33051376,99.550182165999999,null,null,null,"",null,null,null,null,null,null,null,null,null,null,null,null,null,null,null,"2023-11-02",null,null,null,null,null,null,"2023-11-02",null,null,"2024-04-12",125946.09]
[null,"Itag Along","ITAG<XBSP>",null,null,"2022-04-29",17.940559225000001,2040.996789,1794.5497542000001,"2022-01-21",1507.7672573,null,"2023-11-06",95.300906842000003,102.08830134999999,101.37663243,99.731330524000001,null,null,null,"",null,null,null,null,null,null,null,null,null,null,null,null,null,null,null,"2023-11-03",94.187963726000007,104.7107438,96.613190731000003,104.24886191,null,null,"2023-11-03",0.98,null,"2024-04-19",125124.3]
[null,"Ivbx2","IVBX<XBSP>",null,null,"2022-05-06",18.088086168,2408.6012230000001,1892.7269704,"2022-01-28",1447.6352061,null,"2023-11-07",93.981863149000006,102.80963555,101.4227721,99.061692210999993,null,null,null,"",null,null,null,null,null,null,null,null,null,null,null,null,null,null,null,"2023-11-06",95.300906842000003,104.79338842999999,96.969696970000001,103.49013657,null,null,"2023-11-06",0.91,null,"2024-04-26",126526.27]
[null,"Midlarge Cap","MLCX<XBSP>",null,null,"2022-05-13",17.831517569999999,1894.594196,1889.2302408999999,"2022-02-04",1421.0795163,null,"2023-11-08",93.528441880000003,102.73085694,101.46893277,99.438236551000003,null,null,null,"",null,null,null,null,null,null,null,null,null,null,null,null,null,null,null,"2023-11-07",93.981863149000006,104.95867767999999,98.484848485000001,103.3383915,null,null,"2023-11-07",0.88,null,"2024-05-03",128508.67]
[null,"Small Cap","SMLL<XBSP>",null,null,"2022-05-20",18.304121941999998,1783.285826,1914.9984608,"2022-02-11",1425.1047504999999,null,"2023-11-09",93.652102225999997,102.60799539999999,101.51511445,99.747613522999998,null,null,null,"",null,null,null,null,null,null,null,null,null,null,null,null,null,null,null,"2023-11-08",93.528441880000003,104.95867767999999,98.039215686000006,103.3383915,null,null,"2023-11-08",0.82,null,"2024-05-10",127599.57]
[null,"Ind Fdo Imob","IFIX<XBSP>",null,null,"2022-05-27",19.246823502000002,1993.9909520000001,1906.6564398,"2022-02-18",1447.1638405000001,null,"2023-11-10",97.938994229000002,103.93031070000001,101.56131714,100.17911298,null,null,null,"",null,null,null,null,null,null,null,null,null,null,null,null,null,null,null,"2023-11-09",93.652102225999997,103.47107438,98.306595365000007,101.21396054,null,null,"2023-11-09",0.81,null,"2024-05-17",128150.71]
[null,null,null,null,null,"2022-06-03",19.691988126999998,1692.003524,1898.3871291,"2022-02-25",1492.3228076,null,"2023-11-13",97.073371804999994,103.79413981,101.60754095,100.23610347,null,null,null,"",null,null,null,null,null,null,null,null,null,null,null,null,null,null,null,"2023-11-10",97.938994229000002,104.7107438,102.31729055,103.3383915,null,null,"2023-11-10",0.78,null,"2024-05-24",124305.57]
[null,null,null,null,null,"2022-06-10",17.976795012,1838.2336519999999,1864.1744246000001,"2022-03-04",1471.1607624999999,null,"2023-11-14",99.587798845999998,106.16947150999999,101.65378578000001,99.086116708000006,null,null,null,"",null,null,null,null,null,null,null,null,null,null,null,null,null,null,null,"2023-11-13",97.073371804999994,104.46280991,102.13903743,102.73141122,null,null,"2023-11-13",0.74,null,"2024-05-31",122098.09]
[null,null,null,null,null,"2022-06-17",15.292714182999999,2279.8556480000002,1845.4785211999999,"2022-03-11",1524.9141921999999,null,"2023-11-15",null,null,null,null,null,null,null,"",null,null,null,null,null,null,null,null,null,null,null,null,null,null,null,"2023-11-14",99.587798845999998,113.553719,105.25846702,107.28376326999999,null,null,"2023-11-14",0.73,null,"2024-06-07",120767.19]
[null,null,null,null,null,"2022-06-24",15.155236873,2271.7731690000001,1850.2742321999999,"2022-03-18",1583.2511847999999,null,"2023-11-16",99.917559768999993,107.43961829,101.70005159999999,98.868331603000001,null,null,null,"",null,null,null,null,null,null,null,null,null,null,null,null,null,null,null,"2023-11-15",null,null,null,null,null,null,"2023-11-15",null,null,"2024-06-14",119662.38]
[null,null,null,null,null,"2022-07-01",14.585688014,1562.6362690000001,1826.5031272000001,"2022-03-25",1665.5409540999999,null,"2023-11-17",101.03050288,107.55510106,101.74633856,99.426024302000002,null,null,null,"",null,null,null,null,null,null,null,null,null,null,null,null,null,null,null,"2023-11-16",99.917559768999993,121.40495867,106.68449197,115.02276175999999,null,null,"2023-11-16",0.7,null,"2024-06-21",121341.13]
[null,null,null,null,null,"2022-07-08",15.30580726,1658.40987,1818.7653654000001,"2022-04-01",1762.6769016000001,null,"2023-11-20",96.659798933999994,108.57558539999999,101.79264652000001,99.169567076000007,null,null,null,"",null,null,null,null,null,null,null,null,null,null,null,null,null,null,null,"2023-11-17",101.03050288,122.80991735000001,108.64527629,115.32625188999999,null,null,"2023-11-17",0.7,null,"2024-06-28",123906.55]
[null,null,null,null,null,"2022-07-15",15.410551878,1489.599702,1867.5274365,"2022-04-08",1789.6856901000001,null,"2023-11-21",98.256786915999996,108.29023596,101.83897562,99.338503184999993,null,null,null,"",null,null,null,null,null,null,null,null,null,null,null,null,null,null,null,"2023-11-20",96.659798933999994,134.46280992000001,103.62791006,117.75417299,null,null,"2023-11-20",0.7,null,"2024-07-05",126267.05]
[null,null,null,null,null,"2022-07-22",15.587308420999999,1166.7535660000001,1852.3641835000001,"2022-04-15",1750.4368975,null,"2023-11-22",97.920578919999997,108.64302865000001,101.88532571,99.668233904999994,null,null,null,"",null,null,null,null,null,null,null,null,null,null,null,null,null,null,null,"2023-11-21",98.256786915999996,135.61268572,104.20683694,118.05766312,null,null,"2023-11-21",0.7,null,"2024-07-12",128896.98]
[null,null,null,null,null,"2022-07-29",16.012833430000001,1357.1685150000001,1799.7620085999999,"2022-04-22",1756.8291025000001,null,"2023-11-23",97.710448921999998,109.10889913,101.93169693999999,99.592925037000001,null,null,null,"",null,null,null,null,null,null,null,null,null,null,null,null,null,null,null,"2023-11-22",97.920578919999997,138.73021872999999,104.30332475,119.72685887,null,null,"2023-11-22",0.7,null,"2024-07-19",127616.46]
[null,null,null,null,null,"2022-08-05",16.137217664000001,1949.050133,1764.4119248,"2022-04-29",1794.5497542000001,null,"2023-11-24",93.802030965,108.19648433,101.97808931,99.584783537999996,null,null,null,"",null,null,null,null,null,null,null,null,null,null,null,null,null,null,null,"2023-11-23",97.710448921999998,136.65186338999999,104.20683694,117.75417299,null,null,"2023-11-23",0.7,null,"2024-07-26",127492.49]
[null,null,null,null,null,"2022-08-12",17.086465762,1572.349334,1739.6238585000001,"2022-05-06",1892.7269704,null,"2023-11-27",93.760004965999997,108.38110851,102.02450279999999,99.633632532999997,null,null,null,"",null,null,null,null,null,null,null,null,null,null,null,null,null,null,null,"2023-11-24",93.802030965,135.26629317000001,100.73327571,116.84370258,null,null,"2023-11-24",0.7,null,"2024-08-02",125854.09]
[null,null,null,null,null,"2022-08-19",15.975775626000001,1645.77269,1729.0459249,"2022-05-13",1889.2302408999999,null,"2023-11-28",93.675952967000001,109.07663429,102.07093743,99.462661049000005,null,null,null,"",null,null,null,null,null,null,null,null,null,null,null,null,null,null,null,"2023-11-27",93.760004965999997,138.55702245000001,101.02273914,118.51289833,null,null,"2023-11-27",0.7,null,"2024-08-09",130614.59]
[null,null,null,null,null,"2022-08-26",16.197941912000001,1198.842013,1667.8806219000001,"2022-05-20",1914.9984608,null,"2023-11-29",93.928108964000003,108.75538235,102.11739319,99.596995786999997,null,null,null,"",null,null,null,null,null,null,null,null,null,null,null,null,null,null,null,"2023-11-28",93.675952967000001,140.02919080999999,101.02273914,119.42336874,null,null,"2023-11-28",0.68,null,"2024-08-16",133953.25]
[null,null,null,null,null,"2022-09-02",16.204674223000001,1296.4297759999999,1637.4518720999999,"2022-05-27",1906.6564398,null,"2023-11-30",91.826808987000007,109.76003166,102.16387008,100.45592395,null,null,null,"",null,null,null,null,null,null,null,null,null,null,null,null,null,null,null,"2023-11-29",93.928108964000003,141.06836848,100.44381227,117.60242792,null,null,"2023-11-29",0.68,null,"2024-08-23",135608.47]
[null,null,null,null,null,"2022-09-09",16.521092872000001,1806.9253639999999,1635.0435422,"2022-06-03",1898.3871291,null,"2023-12-01",93.087588972999995,110.49600271,102.2103681,100.12212248,null,null,null,"",null,null,null,null,null,null,null,null,null,null,null,null,null,null,null,"2023-11-30",91.826808987000007,142.19414429,99.189470717999995,119.27162367,null,null,"2023-11-30",0.64,null,"2024-08-30",136004.01]
[null,null,null,null,null,"2022-09-16",15.477584561,1682.116869,1589.0636362,"2022-06-10",1864.1744246000001,null,"2023-12-04",92.835432976000007,109.30460868999999,102.25688725000001,99.918585007000004,null,null,null,"",null,null,null,null,null,null,null,null,null,null,null,null,null,null,null,"2023-12-01",93.087588972999995,148.60240658000001,100.34732446,124.73444612999999,null,null,"2023-12-01",0.61,null,"2024-09-06",134572.45000000001]
[null,null,null,null,null,"2022-09-23",16.366249704000001,1789.127622,1551.9370555999999,"2022-06-17",1845.4785211999999,null,"2023-12-05",93.549874967999997,109.39120569000001,102.30342754,100.79583155,null,null,null,"",null,null,null,null,null,null,null,null,null,null,null,null,null,null,null,"2023-12-04",92.835432976000007,147.30343449,99.768397590000006,125.79666159999999,null,null,"2023-12-04",0.56000000000000005,null,"2024-09-13",134881.95000000001]
[null,null,null,null,null,"2022-09-30",16.453769756,1331.4024529999999,1534.1498389999999,"2022-06-24",1850.2742321999999,null,"2023-12-06",93.507848968000005,108.28732239,102.34998908,99.796462519000002,null,null,null,"",null,null,null,null,null,null,null,null,null,null,null,null,null,null,null,"2023-12-05",93.549874967999997,148.77560285999999,100.34732446,125.3414264,null,null,"2023-12-05",0.51,null,"2024-09-20",131065.44]
[null,null,null,null,null,"2022-10-07",17.221253288,1672.032457,1535.1977303000001,"2022-07-01",1826.5031272000001,null,"2023-12-07",93.760004965999997,108.62084926999999,102.39657176,99.629561784000003,null,null,null,"",null,null,null,null,null,null,null,null,null,null,null,null,null,null,null,"2023-12-06",93.507848968000005,148.34261215999999,99.189470717999995,125.79666159999999,null,null,"2023-12-06",0.48,null,"2024-09-27",132155.76]
[null,null,null,null,null,"2022-10-14",17.032748560000002,882.69103800000005,1488.5124484999999,"2022-07-08",1818.7653654000001,null,"2023-12-08",94.600524956000001,109.55526243,102.44317569,100.05495512,null,null,null,"",null,null,null,null,null,null,null,null,null,null,null,null,null,null,null,"2023-12-07",93.760004965999997,146.95704194000001,98.900007282000004,127.01062215,null,null,"2023-12-07",0.48]
[null,null,null,null,null,"2022-10-21",18.163776923,1205.7473460000001,1491.51197,"2022-07-15",1867.5274365,null,"2023-12-11",94.726602955000004,109.40254967,102.48980075999999,100.62893081,null,null,null,"",null,null,null,null,null,null,null,null,null,null,null,null,null,null,null,"2023-12-08",94.600524956000001,148.94879913,99.285958530000002,128.67981791,null,null,"2023-12-08",0.47]
[null,null,null,null,null,"2022-10-28",17.241450223000001,1477.5160229999999,1500.7694706,"2022-07-22",1852.3641835000001,null,"2023-12-12",95.399018948000005,108.96001366,102.53644709,100.70220431,null,null,null,"",null,null,null,null,null,null,null,null,null,null,null,null,null,null,null,"2023-12-11",94.726602955000004,148.42921029999999,99.768397590000006,128.98330804,null,null,"2023-12-11",0.47]
[null,null,null,null,null,"2022-11-04",18.1503123,1363.965627,1455.7629701999999,"2022-07-29",1799.7620085999999,null,"2023-12-13",96.659798933999994,111.59951534,102.58311467,100.91388329,null,null,null,"",null,null,null,null,null,null,null,null,null,null,null,null,null,null,null,"2023-12-12",95.399018948000005,148.51580844,99.092982906000003,128.98330804,null,null,"2023-12-12",0.41]
[null,null,null,null,null,"2022-11-11",20.950953961,3050.9336939999998,1569.5002285999999,"2022-08-05",1764.4119248,null,"2023-12-14",98.635020912000002,112.78650451999999,102.62798376000001,99.554252915999996,null,null,null,"",null,null,null,null,null,null,null,null,null,null,null,null,null,null,null,"2023-12-13",96.659798933999994,151.71993957999999,101.11922695,130.34901366,null,null,"2023-12-13",0.41]
[null,null,null,null,null,"2022-11-18",20.082485753,1407.092236,1551.1401937000001,"2022-08-12",1739.6238585000001,null,"2023-12-15",97.626396923000001,112.23052007,102.67287245,100.5414097,null,null,null,"",null,null,null,null,null,null,null,null,null,null,null,null,null,null,null,"2023-12-14",98.635020912000002,152.49932283000001,102.85600757,132.32169954,null,null,"2023-12-14",0.38]
[null,null,null,null,null,"2022-11-25",21.293783986000001,1391.461145,1565.95705,"2022-08-19",1729.0459249,null,"2023-12-18",98.929202908999997,112.99487693,102.71778073999999,100.54548045,null,null,null,"",null,null,null,null,null,null,null,null,null,null,null,null,null,null,null,"2023-12-15",97.626396923000001,156.13644467,101.02273914,133.99089530000001,null,null,"2023-12-15",0.36]
[null,null,null,null,null,"2022-12-02",22.548065439999998,2749.460223,1677.7286228,"2022-08-26",1667.8806219000001,null,"2023-12-19",96.491694934999998,113.65610354,102.76270877,99.047444587000001,null,null,null,"",null,null,null,null,null,null,null,null,null,null,null,null,null,null,null,"2023-12-18",98.929202908999997,160.46635162999999,103.62791006,134.29438543000001,null,null,"2023-12-18",0.37]
[null,null,null,null,null,"2022-12-09",22.816322166999999,1752.5388949999999,1673.5450483,"2022-09-02",1637.4518720999999,null,"2023-12-20",95.693200943999997,112.75381729999999,102.8076564,99.257088193000001,null,null,null,"",null,null,null,null,null,null,null,null,null,null,null,null,null,null,null,"2023-12-19",96.491694934999998,161.93851999,102.47005632,134.44613050000001,null,null,"2023-12-19",0.36]
[null,null,null,null,null,"2022-12-16",21.873798530999998,2218.3486590000002,{"$f":"IFERROR(VLOOKUP(F75,$J$11:$K$607,2,0),NA())","v":1714.7936474999999},"2022-09-09",1635.0435422,null,"2023-12-21",98.340838915000006,113.94152194,102.85262363,99.234699070000005,null,null,null,"",null,null,null,null,null,null,null,null,null,null,null,null,null,null,null,"2023-12-20",95.693200943999997,159.16737954000001,101.21571477000001,133.53566008999999,null,null,"2023-12-20",0.33]
[null,null,null,null,null,"2022-12-23",20.808021804999999,2150.739724,1742.6099631,"2022-09-16",1589.0636362,null,"2023-12-22",99.391488902999996,114.4336577,102.89761059999999,98.957888095000001,null,null,null,{"$f":"IF(S76=\"\",\"\",IF(T76=\"\",NA(),T76-V76))","v":""},null,null,null,null,null,null,null,null,null,null,null,null,null,null,null,"2023-12-21",98.340838915000006,164.96945486000001,103.43493444000001,138.54324733999999,null,null,"2023-12-21",0.32]
[null,null,null,null,null,"2022-12-30",21.293783986000001,1063.7761559999999,1722.0233248,"2022-09-23",1551.9370555999999,null,"2023-12-25",null,null,null,null,null,null,null,"",null,null,null,null,null,null,null,null,null,null,null,null,null,null,null,"2023-12-22",99.391488902999996,165.48904368999999,104.30332475,140.81942337000001,null,null,"2023-12-22",0.31]
[null,null,null,null,null,"2023-01-06",21.989801440000001,1471.071281,1706.5647727999999,"2022-09-30",1534.1498389999999,null,"2023-12-26",99.181358906,115.10601278999999,102.94261729,98.447009016999999,null,null,null,"",null,null,null,null,null,null,null,null,null,null,null,null,null,null,null,"2023-12-25",null,null,null,null,null,null,"2023-12-25"]
[null,null,null,null,null,"2023-01-13",23.512339620999999,1831.3499549999999,1779.5385357,"2022-10-07",1535.1977303000001,null,"2023-12-27",98.887176909000004,115.67562554,102.9876436,98.320815777999996,null,null,null,"",null,null,null,null,null,null,null,null,null,null,null,null,null,null,null,"2023-12-26",99.181358906,167.65399717,104.30332475,141.42640363999999,null,null,"2023-12-26",0.31]
[null,null,null,null,null,"2023-01-20",24.070603621,1750.0785719999999,1821.4101685000001,"2022-10-14",1488.5124484999999,null,"2023-12-28",99.853774897999998,115.66831573,103.03268962999999,98.538600883000001,null,null,null,"",null,null,null,null,null,null,null,null,null,null,null,null,null,null,null,"2023-12-27",98.887176909000004,168.95296925,104.01386131,141.72989378,null,null,"2023-12-27",0.28999999999999998]
[null,null,null,null,null,"2023-01-27",23.396336712,1315.4423959999999,1808.9429663999999,"2022-10-21",1491.51197,null,"2023-12-29",null,null,103.07775538999999,98.538600883000001,null,null,null,"",null,null,null,null,null,null,null,null,null,null,null,null,null,null,null,"2023-12-28",99.853774897999998,170.25194134,104.78576381000001,140.97116844000001,null,null,"2023-12-28",0.28000000000000003]
[null,null,null,null,null,"2023-02-03",22.511814530999999,1484.774539,1818.2359595999999,"2022-10-28",1500.7694706,null,"2024-01-01",null,null,null,null,null,null,null,"",null,null,null,null,null,null,null,null,null,null,null,null,null,null,null,"2023-12-29",null,null,null,null,null,null,"2023-12-29"]
[null,null,null,null,null,"2023-02-10",20.532514895999999,2247.643129,1756.4443776999999,"2022-11-04",1455.7629701999999,null,"2024-01-02",98.887176909000004,114.38512683,103.12284076,99.562394415,null,null,null,"",null,null,null,null,null,null,null,null,null,null,null,null,null,null,null,"2024-01-01",null,null,null,null,null,null,"2024-01-01"]
[null,null,null,null,null,"2023-02-17",20.728269805,1273.9525739999999,1746.2028651999999,"2022-11-11",1569.5002285999999,null,"2024-01-03",97.794500920999994,114.50349731999999,103.16794586,100.16486535999999,null,null,null,"",null,null,null,null,null,null,null,null,null,null,null,null,null,null,null,"2024-01-02",98.887176909000004,168.08698785999999,103.9173735,138.54324733999999,null,null,"2024-01-02",0.28000000000000003]
[null,null,null,null,null,"2023-02-24",20.336759987000001,607.84710299999995,1685.9248620000001,"2022-11-18",1551.1401937000001,null,"2024-01-04",97.290188927000003,113.11735919,103.21307069,100.11601636,null,null,null,"",null,null,null,null,null,null,null,null,null,null,null,null,null,null,null,"2024-01-03",97.794500920999994,169.55915622000001,103.24195881999999,137.78452200000001,null,null,"2024-01-03",0.28000000000000003]
[null,null,null,null,null,"2023-03-03",21.330034895000001,1654.44784,1601.6931402,"2022-11-25",1565.95705,null,"2024-01-05",97.332214926000006,113.8043856,103.25821526,99.527793043000003,null,null,null,"",null,null,null,null,null,null,null,null,null,null,null,null,null,null,null,"2024-01-04",97.290188927000003,167.04781019000001,102.2770807,135.66009105000001,null,null,"2024-01-04",0.27]
[null,null,null,null,null,"2023-03-10",19.568240715000002,1522.455211,1583.9943953,"2022-12-02",1677.7286228,null,"2024-01-08",98.172734917,114.15230796,103.30337968000001,99.428059676999993,null,null,null,"",null,null,null,null,null,null,null,null,null,null,null,null,null,null,null,"2024-01-05",97.332214926000006,166.61481950000001,102.75951976,135.35660091,null,null,"2024-01-05",0.27]
[null,null,null,null,null,"2023-03-17",18.625676575,1863.1447470000001,1556.6710175000001,"2022-12-09",1673.5450483,null,"2024-01-09",93.045562973000003,113.30758640000001,103.34856383,99.605137286000001,null,null,null,"",null,null,null,null,null,null,null,null,null,null,null,null,null,null,null,"2024-01-08",98.172734917,166.70141763999999,103.145471,134.44613050000001,null,null,"2024-01-08",0.2]
[null,null,null,null,null,"2023-03-24",18.859045345999998,1223.1396910000001,1485.3171688,"2022-12-16",1714.7936474999999,null,"2024-01-10",90.271847003999994,112.78564251,103.39376772,99.531863792999999,null,null,null,"",null,null,null,null,null,null,null,null,null,null,null,null,null,null,null,"2024-01-09",93.045562973000003,159.25397767999999,98.417568222,130.95599393000001,null,null,"2024-01-09",0.2]
[null,null,null,null,null,"2023-03-31",19.395903083,994.690922,1480.0029199999999,"2022-12-23",1742.6099631,null,"2024-01-11",89.095119017000002,112.61984452,103.43899132999999,99.314078687999995,null,null,null,"",null,null,null,null,null,null,null,null,null,null,null,null,null,null,null,"2024-01-10",90.271847003999994,155.09726701,96.487811981999997,127.46585736,null,null,"2024-01-10",0.2]
[null,null,null,null,null,"2023-04-07",18.360534591,773.94696399999998,1426.3779724999999,"2022-12-30",1722.0233248,null,"2024-01-12",89.557405012000004,112.91199517,103.48423481,98.803199609000004,null,null,null,"",null,null,null,null,null,null,null,null,null,null,null,null,null,null,null,"2024-01-11",89.095119017000002,154.75087445,96.101860735000002,129.28679818000001,null,null,"2024-01-11",0.19]
[null,null,null,null,null,"2023-04-14",20.055471159,1540.0196269999999,1403.9679473000001,"2023-01-06",1706.5647727999999,null,"2024-01-15",89.431327013000001,113.37165059,103.52949802000001,99.255052817999996,null,null,null,"",null,null,null,null,null,null,null,null,null,null,null,null,null,null,null,"2024-01-12",89.557405012000004,155.01066886999999,96.005372922000006,128.52807283999999,null,null,"2024-01-12",0.19]
[null,null,null,null,null,"2023-04-21",19.856066856999998,676.16155100000003,1321.3589457,"2023-01-13",1779.5385357,null,"2024-01-16",86.909767040999995,111.45207805,103.57478107999999,99.810710142000005,null,null,null,"",null,null,null,null,null,null,null,null,null,null,null,null,null,null,null,"2024-01-15",89.431327013000001,154.49108003000001,96.487811981999997,129.59028832000001,null,null,"2024-01-15",0.17]
[null,null,null,null,null,"2023-04-28",19.311539723999999,919.55132100000003,1290.9057860999999,"2023-01-20",1821.4101685000001,null,"2024-01-17",86.405455047000004,110.78815336,103.62008388,100.43760558,null,null,null,"",null,null,null,null,null,null,null,null,null,null,null,null,null,null,null,"2024-01-16",86.909767040999995,148.862201,94.172104494999999,127.01062215,null,null,"2024-01-16",0.17]
[null,null,null,null,null,"2023-05-05",19.012433270999999,1246.8697050000001,1272.6054142,"2023-01-27",1808.9429663999999,null,"2024-01-18",87.456105034999993,109.74677403,103.66540654000001,100.55362194999999,null,null,null,"",null,null,null,null,null,null,null,null,null,null,null,null,null,null,null,"2024-01-17",86.405455047000004,144.53229404000001,93.110738562999998,125.79666159999999,null,null,"2024-01-17",0.17]
[null,null,null,null,null,"2023-05-12",18.605955269999999,1309.2230030000001,1200.4192507,"2023-02-03",1818.2359595999999,null,"2024-01-19",88.548781023000004,110.02253797,103.71074905,100.18725448000001,null,null,null,"",null,null,null,null,null,null,null,null,null,null,null,null,null,null,null,"2024-01-18",87.456105034999993,147.82302333000001,93.593177623000003,129.28679818000001,null,null,"2024-01-18",0.17]
[null,null,null,null,null,"2023-05-19",18.861826344000001,1459.8710100000001,1214.7206688000001,"2023-02-10",1756.4443776999999,null,"2024-01-22",87.666235033000007,109.13113885,103.7561113,100.73069955,null,null,null,"",null,null,null,null,null,null,null,null,null,null,null,null,null,null,null,"2024-01-19",88.548781023000004,150.07457493999999,94.172104494999999,128.98330804,null,null,"2024-01-19",0.17]
[null,null,null,null,null,"2023-05-26",19.551128968,1527.8584980000001,1285.4907762,"2023-02-17",1746.2028651999999,null,"2024-01-23",89.221197016000005,110.5629029,103.80149341000001,101.18865889,null,null,null,"",null,null,null,null,null,null,null,null,null,null,null,null,null,null,null,"2024-01-22",87.666235033000007,148.34261215999999,93.689665434999995,130.50075873,null,null,"2024-01-22",0.17]
[null,null,null,null,null,"2023-06-02",19.645124781,1336.8592180000001,1261.0608821999999,"2023-02-24",1685.9248620000001,null,"2024-01-24",91.280470992999994,110.17774193,103.84689537,100.12415786,null,null,null,"",null,null,null,null,null,null,null,null,null,null,null,null,null,null,null,"2024-01-23",89.221197016000005,150.85395818999999,95.136982614999994,131.10773900000001,null,null,"2024-01-23",0.17]
[null,null,null,null,null,"2023-06-09",19.817450437000002,887.77824499999997,1212.2395770999999,"2023-03-03",1601.6931402,null,"2024-01-25",91.532626989999997,110.48205547000001,103.89231719999999,100.20557285,null,null,null,"",null,null,null,null,null,null,null,null,null,null,null,null,null,null,null,"2024-01-24",91.280470992999994,154.31788374999999,96.873763229999994,136.11532625000001,null,null,"2024-01-24",0.13]
[null,null,null,null,null,"2023-06-16",20.326594419999999,1359.900836,1173.528507,"2023-03-10",1583.9943953,null,"2024-01-26",91.784782987,111.17044385,103.93775888,99.987787750999999,null,null,null,"",null,null,null,null,null,null,null,null,null,null,null,null,null,null,null,"2024-01-25",91.532626989999997,155.18386515,96.680787605999996,137.02579666,null,null,"2024-01-25",0.12]
[null,null,null,null,null,"2023-06-23",19.684289702000001,937.20522900000003,1151.5335484,"2023-03-17",1556.6710175000001,null,"2024-01-29",89.767535010000003,110.76990472,103.98322041999999,100.19132523,null,null,null,"",null,null,null,null,null,null,null,null,null,null,null,null,null,null,null,"2024-01-26",91.784782987,157.26222048,97.259714478000006,144.15781487000001,null,null,"2024-01-26",0.14000000000000001]
[null,null,null,null,null,"2023-06-30",19.637291796,923.588798,1146.0641542000001,"2023-03-24",1485.3171688,null,"2024-01-30",89.389301013999997,109.82096678000001,104.02870195,101.03193503,null,null,null,"",null,null,null,null,null,null,null,null,null,null,null,null,null,null,null,"2024-01-29",89.767535010000003,156.56943537000001,96.294836357999998,141.12291350999999,null,null,"2024-01-29",0.14000000000000001]
[null,null,null,null,null,"2023-07-07",20.475421123,1019.061877,1164.9191475,"2023-03-31",1480.0029199999999,null,"2024-01-31",88.422703024,110.12307359,104.07420333,100.82229142,null,null,null,"",null,null,null,null,null,null,null,null,null,null,null,null,null,null,null,"2024-01-30",89.389301013999997,155.09726701,96.101860735000002,137.93626707000001,null,null,"2024-01-30",0.14000000000000001]
[null,null,null,null,null,"2023-07-14",21.274385528,1093.173393,1130.5463603000001,"2023-04-07",1426.3779724999999,null,"2024-02-01",88.128521027999994,110.75125094000001,104.11787019,100.44574708,null,null,null,"",null,null,null,null,null,null,null,null,null,null,null,null,null,null,null,"2024-01-31",88.422703024,153.5385005,95.619421674999998,139.45371775000001,null,null,"2024-01-31",0.14000000000000001]
[null,null,null,null,null,"2023-07-21",21.321383434000001,1056.116696,1159.7736792000001,"2023-04-14",1403.9679473000001,null,"2024-02-02",90.229821005000005,109.63170501,104.16155538,100.69202743,null,null,null,"",null,null,null,null,null,null,null,null,null,null,null,null,null,null,null,"2024-02-01",88.128521027999994,152.15293027999999,95.040494803000001,140.06069803,null,null,"2024-02-01",0.14000000000000001]
[null,null,null,null,null,"2023-07-28",22.230009620000001,1545.6879839999999,1207.9380378000001,"2023-04-21",1321.3589457,null,"2024-02-05",89.683483011000007,109.98619585,104.20525891,101.87661557,null,null,null,"",null,null,null,null,null,null,null,null,null,null,null,null,null,null,null,"2024-02-02",90.229821005000005,148.25601402000001,96.487811981999997,137.93626707000001,null,null,"2024-02-02",0.13]
[null,null,null,null,null,"2023-08-04",21.987187105,1792.0350659999999,1249.8738347999999,"2023-04-28",1290.9057860999999,null,"2024-02-06",91.322496991999998,112.41948013,104.24898075999999,101.13166839,null,null,null,"",null,null,null,null,null,null,null,null,null,null,null,null,null,null,null,"2024-02-05",89.683483011000007,150.42096749999999,96.294836357999998,137.93626707000001,null,null,"2024-02-05",0.13]
[null,null,null,null,null,"2023-08-11",20.099437873999999,2050.4666499999998,1306.8925769,"2023-05-05",1272.6054142,null,"2024-02-07",91.532626989999997,112.01743249,104.29272094,100.97087378000001,null,null,null,"",null,null,null,null,null,null,null,null,null,null,null,null,null,null,null,"2024-02-06",91.322496991999998,155.79005212000001,98.514056034000006,139.90895295999999,null,null,"2024-02-06",0.12]
[null,null,null,null,null,"2023-08-18",19.974110123999999,1395.4433939999999,1301.9366064999999,"2023-05-12",1200.4192507,null,"2024-02-08",89.725509009999996,110.52359548,104.33647946000001,101.36980724999999,null,null,null,"",null,null,null,null,null,null,null,null,null,null,null,null,null,null,null,"2024-02-07",91.532626989999997,158.73438884999999,98.610543845999999,141.57814870999999,null,null,"2024-02-07",0.12]
[null,null,null,null,null,"2023-08-25",19.751024730000001,1040.8123929999999,1264.4715215000001,"2023-05-19",1214.7206688000001,null,"2024-02-09",88.170547026999998,110.35876293,104.38025630999999,101.19272964,null,null,null,"",null,null,null,null,null,null,null,null,null,null,null,null,null,null,null,"2024-02-08",89.725509009999996,156.39623908999999,96.777275418000002,142.64036419000001,null,null,"2024-02-08",0.11]
[null,null,null,null,null,"2023-09-01",20.715072326000001,1007.167774,1239.1106411999999,"2023-05-26",1285.4907762,null,"2024-02-12",null,null,null,null,null,null,null,"",null,null,null,null,null,null,null,null,null,null,null,null,null,null,null,"2024-02-09",88.170547026999998,154.14468747999999,95.329958239000007,140.81942337000001,null,null,"2024-02-09",0.11]
[null,null,null,null,null,"2023-09-08",20.165326176000001,861.44170599999995,1237.0847535,"2023-06-02",1261.0608821999999,null,"2024-02-13",null,null,null,null,null,null,null,"",null,null,null,null,null,null,null,null,null,null,null,null,null,null,null,"2024-02-12",null,null,null,null,null,null,"2024-02-12"]
[null,null,null,null,null,"2023-09-15",20.539790945,1090.753183,1216.3810879,"2023-06-09",1212.2395770999999,null,"2024-02-14",87.161923037999998,109.49037070999999,104.42405149,101.20494189,null,null,null,"",null,null,null,null,null,null,null,null,null,null,null,null,null,null,null,"2024-02-13",null,null,null,null,null,null,"2024-02-13"]
[null,null,null,null,null,"2023-09-22",19.328755948000001,1116.895923,1230.2034490000001,"2023-06-16",1173.528507,null,"2024-02-15",86.993819040000005,110.16776853,104.46786512,101.17848201,null,null,null,"",null,null,null,null,null,null,null,null,null,null,null,null,null,null,null,"2024-02-14",87.161923037999998,154.75087445,94.461567931000005,142.03338392000001,null,null,"2024-02-14",0.11]
[null,null,null,null,null,"2023-09-29",19.225180586,1136.0559109999999,1246.5470731,"2023-06-23",1151.5335484,null,"2024-02-16",89.137145016000005,110.96232141999999,104.51169709,101.28228613,null,null,null,"",null,null,null,null,null,null,null,null,null,null,null,null,null,null,null,"2024-02-15",86.993819040000005,159.60037023999999,94.461567931000005,149.92412747,null,null,"2024-02-15",0.11]
[null,null,null,null,null,"2023-10-06",18.061949600999998,1054.6618350000001,1249.2855314000001,"2023-06-30",1146.0641542000001,null,"2024-02-19",89.347275014000004,111.22942222,104.55554752,100.92406016,null,null,null,"",null,null,null,null,null,null,null,null,null,null,null,null,null,null,null,"2024-02-16",89.137145016000005,164.88285672000001,96.391324170000004,153.41426404000001,null,null,"2024-02-16",0.11]
[null,null,null,null,null,"2023-10-13",17.791060194,700.59962199999995,1219.0875490000001,"2023-07-07",1164.9191475,null,"2024-02-20",89.935639007999995,111.98830535,104.59941628,100.56379882,null,null,null,"",null,null,null,null,null,null,null,null,null,null,null,null,null,null,null,"2024-02-19",89.347275014000004,163.84367904999999,96.294836357999998,154.17298937999999,null,null,"2024-02-19",0.11]
[null,null,null,null,null,"2023-10-20",17.089934669000002,1077.8419490000001,1220.7587223,"2023-07-14",1130.5463603000001,null,"2024-02-21",91.784782987,112.08784104,104.64330348999999,100.35008446000001,null,null,null,"",null,null,null,null,null,null,null,null,null,null,null,null,null,null,null,"2024-02-20",89.935639007999995,155.87665025999999,96.970251042000001,156.75265554000001,null,null,"2024-02-20",0.11]
[null,null,null,null,null,"2023-10-27",17.400660754,795.50542299999995,1163.0523714999999,"2023-07-21",1159.7736792000001,null,"2024-02-22",90.986288995999999,112.26797417,104.68720904,100.58618794,null,null,null,"",null,null,null,null,null,null,null,null,null,null,null,null,null,null,null,"2024-02-21",91.784782987,151.28694888999999,97.452690102000005,157.05614567999999,null,null,"2024-02-21",0.11]
[null,null,null,null,null,"2023-11-03",18.205361641,746.0412,1082.5913048,"2023-07-28",1207.9380378000001,null,"2024-02-23",90.187795004999998,111.55956141999999,104.73113305,101.46546986,null,null,null,"",null,null,null,null,null,null,null,null,null,null,null,null,null,null,null,"2024-02-22",90.986288995999999,151.11375261000001,97.838641350000003,161.60849772,null,null,"2024-02-22",0.09]
[null,null,null,null,null,"2023-11-10",18.930389172000002,1272.148412,1022.7206711,"2023-08-04",1249.8738347999999,null,"2024-02-26",89.095119017000002,111.72361816999999,104.77507550999999,101.40033787,null,null,null,"",null,null,null,null,null,null,null,null,null,null,null,null,null,null,null,"2024-02-23",90.187795004999998,153.5385005,96.777275418000002,162.36722306999999,null,null,"2024-02-23",0.09]
[null,null,null,null,null,"2023-11-17",19.527939334999999,1497.7182049999999,1030.5879643000001,"2023-08-11",1306.8925769,null,"2024-02-27",90.986288995999999,113.51686391,104.81903644,100.90370641,null,null,null,"",null,null,null,null,null,null,null,null,null,null,null,null,null,null,null,"2024-02-26",89.095119017000002,148.68900472000001,96.198348546000005,161.91198786000001,null,null,"2024-02-26",0.09]
[null,null,null,null,null,"2023-11-24",18.130765639,1411.435119,1059.0974048,"2023-08-18",1301.9366064999999,null,"2024-02-28",90.566029001000004,112.19460033,104.86301582,100.86706967000001,null,null,null,"",null,null,null,null,null,null,null,null,null,null,null,null,null,null,null,"2024-02-27",90.986288995999999,150.07457493999999,98.224592598000001,164.49165402,null,null,"2024-02-27",0.09]
[null,null,null,null,null,"2023-12-01",17.992672890000001,1142.068595,1069.474391,"2023-08-25",1264.4715215000001,null,"2024-02-29",90.355899003000005,111.21587150000001,104.90701366,101.42883311999999,null,null,null,"",null,null,null,null,null,null,null,null,null,null,null,null,null,null,null,"2024-02-28",90.566029001000004,147.73642519000001,97.452690102000005,166.16084977,null,null,"2024-02-28",0.08]
[null,null,null,null,null,"2023-12-08",18.285104594,1207.389064,1096.0857262,"2023-09-01",1239.1106411999999,null,"2024-03-01",94.264316960000002,111.35409396999999,104.95102996,100.94644928,null,null,null,"",null,null,null,null,null,null,null,null,null,null,null,null,null,null,null,"2024-02-29",90.355899003000005,145.65806985,97.549177913999998,167.98179059,null,null,"2024-02-29",0.08]
[null,null,null,null,null,"2023-12-15",18.869968002,1101.0296960000001,1096.8762271999999,"2023-09-08",1237.0847535,null,"2024-03-04",92.575748809999993,110.63015651000001,104.99506472,100.70016893,null,null,null,"",null,null,null,null,null,null,null,null,null,null,null,null,null,null,null,"2024-03-01",94.264316960000002,147.82302333000001,99.961373214000005,168.58877086000001,null,null,"2024-03-01",0.08]
[null,null,null,null,null,"2023-12-22",19.211138323,976.17509099999995,1086.0515478,"2023-09-15",1216.3810879,null,"2024-03-05",91.478179513000001,110.42118069,105.03911793,100.7266288,null,null,null,"",null,null,null,null,null,null,null,null,null,null,null,null,null,null,null,"2024-03-04",92.575748809999993,144.44569591000001,98.894860016999999,162.36722306999999,null,null,"2024-03-04",0.08]
[null,null,null,null,null,"2023-12-29",19.300492455000001,239.97925499999999,1017.1225743,"2023-09-22",1230.2034490000001,null,"2024-03-06",90.253967603999996,111.10399191,105.08318961000001,100.54344507,null,null,null,"",null,null,null,null,null,null,null,null,null,null,null,null,null,null,null,"2024-03-05",91.478179513000001,143.57971451,97.537479586000003,162.97420334,null,null,"2024-03-05",0.06]
[null,null,null,null,null,"2024-01-05",18.813106281,583.02331600000002,980.84268823000002,"2023-09-29",1246.5470731,null,"2024-03-07",88.903113083999997,110.62948414,105.12727974000001,100.47424233,null,null,null,"",null,null,null,null,null,null,null,null,null,null,null,null,null,null,null,"2024-03-06",90.253967603999996,144.18590148999999,95.501408937999997,163.12594841000001,null,null,"2024-03-06",0.06]
[null,null,null,null,null,"2024-01-12",17.310332248000002,1368.655285,1032.2315854000001,"2023-10-06",1249.2855314000001,null,"2024-03-08",89.662968751999998,109.53562596,105.17138846,101.26193238,null,null,null,"",null,null,null,null,null,null,null,null,null,null,null,null,null,null,null,"2024-03-07",88.903113083999997,137.25805037000001,95.016630212999999,161.30500759,null,null,"2024-03-07",0.08]
[null,null,null,null,null,"2024-01-19",17.115377778999999,1145.8236360000001,1037.4609459000001,"2023-10-13",1219.0875490000001,null,"2024-03-11",89.451897732999996,108.71910919,105.21551564000001,101.31485213000001,null,null,null,"",null,null,null,null,null,null,null,null,null,null,null,null,null,null,null,"2024-03-08",89.662968751999998,141.24156475999999,95.016630212999999,164.79514416000001,null,null,"2024-03-08",7.0000000000000007E-2]
[null,null,null,null,null,"2024-01-26",17.740856700999998,826.370814,1039.8352067999999,"2023-10-20",1220.7587223,null,"2024-03-12",90.929394864000002,110.05028591,105.25966127,101.38812562,null,null,null,"",null,null,null,null,null,null,null,null,null,null,null,null,null,null,null,"2024-03-11",89.451897732999996,138.73021872999999,95.404453192999995,157.05614567999999,null,null,"2024-03-11",7.0000000000000007E-2]
[null,null,null,null,null,"2024-02-02",17.440301894000001,1023.671161,1061.1913575999999,"2023-10-27",1163.0523714999999,null,"2024-03-13",92.280249384000001,110.34182454,105.3038255,101.36777187,null,null,null,"",null,null,null,null,null,null,null,null,null,null,null,null,null,null,null,"2024-03-12",90.929394864000002,140.28898523000001,96.083143409000002,154.93171472,null,null,"2024-03-12",0.04]
[null,null,null,null,null,"2024-02-09",17.042269853000001,706.331095,1017.6669486,"2023-11-03",1082.5913048,null,"2024-03-14",89.494111937,110.06936207,105.34800817999999,101.29653374999999,null,null,null,"",null,null,null,null,null,null,null,null,null,null,null,null,null,null,null,"2024-03-13",92.280249384000001,140.89517219999999,97.343568095999998,153.1107739,null,null,"2024-03-13",0.04]
[null,null,null,null,null,"2024-02-16",17.229101219,811.04375700000003,964.84583723000003,"2023-11-10",1022.7206711,null,"2024-03-15",87.721115380000001,109.25204364,105.39220945,101.6405121,null,null,null,"",null,null,null,null,null,null,null,null,null,null,null,null,null,null,null,"2024-03-14",89.494111937,135.61268572,95.016630212999999,149.92412747,null,null,"2024-03-14",0.05]
[null,null,null,null,null,"2024-02-23",17.432178790999998,1392.2119990000001,963.36713569000005,"2023-11-17",1030.5879643000001,null,"2024-03-18",90.465038622999998,109.43510759,105.4364293,102.02112719,null,null,null,"",null,null,null,null,null,null,null,null,null,null,null,null,null,null,null,"2024-03-15",87.721115380000001,132.14876015999999,94.240984252000004,148.40667678,null,null,"2024-03-15",0.05]
[null,null,null,null,null,"2024-03-01",18.220119771,1282.8546550000001,974.19683262000001,"2023-11-24",1059.0974048,null,"2024-03-19",91.435965308999997,109.93047586,105.48066774,102.48519263999999,null,null,null,"",null,null,null,null,null,null,null,null,null,null,null,null,null,null,null,"2024-03-18",90.465038622999998,136.04567642000001,95.598364683,150.68285281000001,null,null,"2024-03-18",0.05]
[null,null,null,null,null,"2024-03-08",17.330736405,1025.506042,{"$f":"IFERROR(VLOOKUP(F139,$J$11:$K$607,2,0),NA())","v":960.20583092000004},"2023-12-01",1069.474391,null,"2024-03-20",92.238035179999997,111.30621822000001,105.52492463,102.01298568999999,null,null,null,"",null,null,null,null,null,null,null,null,null,null,null,null,null,null,null,"2024-03-19",91.435965308999997,138.47042431,97.440523841000001,154.32473444999999,null,null,"2024-03-19",0.04]
[null,null,null,null,null,"2024-03-15",16.955400306000001,1500.498286,990.93418399999996,"2023-12-08",1096.0857262,null,"2024-03-21",93.082319255000002,110.4732975,105.56731136000001,101.37591337000001,null,null,null,{"$f":"IF(S140=\"\",\"\",IF(T140=\"\",NA(),T140-V140))","v":""},null,null,null,null,null,null,null,null,null,null,null,null,null,null,null,"2024-03-20",92.238035179999997,141.24156475999999,98.797904271999997,157.51138087999999,null,null,"2024-03-20",0.04]
[null,null,null,null,null,"2024-03-22",17.632637181,822.57131700000002,979.11850907999997,"2023-12-15",1096.8762271999999,null,"2024-03-22",91.224894289999995,109.49796497,105.60971514000001,101.5590971,null,null,null,"",null,null,null,null,null,null,null,null,null,null,null,null,null,null,null,"2024-03-21",93.082319255000002,141.06836848,99.185727252999996,156.75265554000001,null,null,"2024-03-21",0.03]
[null,null,null,null,null,"2024-03-29",18.114046524999999,663.08439099999998,1011.665058,"2023-12-22",1086.0515478,null,"2024-03-25",91.056037476,109.41553146,105.65213599,101.50210661,null,null,null,"",null,null,null,null,null,null,null,null,null,null,null,null,null,null,null,"2024-03-22",91.224894289999995,137.43124664000001,97.634435331000006,154.02124430999999,null,null,"2024-03-22",0.03]
[null,null,null,null,null,"2024-04-05",18.554658468,1190.8509429999999,1058.4210293000001,"2023-12-29",1017.1225743,null,"2024-03-26",90.802752252999994,109.35652723,105.69457389,101.50414198,null,null,null,"",null,null,null,null,null,null,null,null,null,null,null,null,null,null,null,"2024-03-25",91.056037476,135.95907828,97.634435331000006,151.28983307999999,null,null,"2024-03-25",0.04]
[null,null,null,null,null,"2024-04-12",18.203800810000001,1051.9714959999999,1034.0607378,"2024-01-05",980.84268823000002,null,"2024-03-27",92.744605625000005,110.06992237,105.73702885,101.47564674,null,null,null,"",null,null,null,null,null,null,null,null,null,null,null,null,null,null,null,"2024-03-26",90.802752252999994,134.57350805999999,97.537479586000003,150.68285281000001,null,null,"2024-03-26",0.04]
[null,null,null,null,null,"2024-04-19",18.819025632999999,1641.337483,1072.1771876,"2024-01-12",1032.2315854000001,null,"2024-03-28",93.715532311000004,110.42806811,105.77950086,101.69139647,null,null,null,"",null,null,null,null,null,null,null,null,null,null,null,null,null,null,null,"2024-03-27",92.744605625000005,135.43948945,98.991815763000005,152.35204855999999,null,null,"2024-03-27",0.04]
[null,null,null,null,null,"2024-04-26",18.241334420000001,1701.1041090000001,1139.4643642000001,"2024-01-19",1037.4609459000001,null,"2024-03-29",null,null,null,null,null,null,null,"",null,null,null,null,null,null,null,null,null,null,null,null,null,null,null,"2024-03-28",93.715532311000004,135.95907828,99.767461722999997,151.89681335,null,null,"2024-03-28",0.04]
[null,null,null,null,null,"2024-05-03",19.249846199,1045.2150360000001,1141.1215853000001,"2024-01-26",1039.8352067999999,null,"2024-04-01",94.137674348999994,109.46637250000001,105.82198993999999,102.85156010999999,null,null,null,"",null,null,null,null,null,null,null,null,null,null,null,null,null,null,null,"2024-03-29",null,null,null,null,null,null,"2024-03-29"]
[null,null,null,null,null,"2024-05-10",18.740694620999999,1218.931595,1180.5523929999999,"2024-02-02",1061.1913575999999,null,"2024-04-02",94.855315812000001,109.94743149999999,105.86449607,102.73757912000001,null,null,null,"",null,null,null,null,null,null,null,null,null,null,null,null,null,null,null,"2024-04-01",94.137674348999994,136.13227456000001,100.34919619,153.1107739,null,null,"2024-04-01",0.04]
[null,null,null,null,null,"2024-05-17",19.416019417000001,1336.974324,1221.0085905000001,"2024-02-09",1017.6669486,null,"2024-04-03",95.699599887000005,109.74905834,105.90701927000001,103.24235207,null,null,null,"",null,null,null,null,null,null,null,null,null,null,null,null,null,null,null,"2024-04-02",94.855315812000001,132.75494714000001,101.80353237,155.38694992000001,null,null,"2024-04-02",0.03]
[null,null,null,null,null,"2024-05-24",18.591707595999999,1494.6746290000001,1228.8903312,"2024-02-16",964.84583723000003,null,"2024-04-04",97.388168037,109.84313754,105.94955951999999,102.25112454000001,null,null,null,"",null,null,null,null,null,null,null,null,null,null,null,null,null,null,null,"2024-04-03",95.699599887000005,132.84154527000001,102.28831108999999,154.32473444999999,null,null,"2024-04-03",0.03]
[null,null,null,null,null,"2024-05-31",17.985888064000001,869.15257299999996,1197.0670941999999,"2024-02-23",963.36713569000005,null,"2024-04-05",95.995099312999997,109.29824709,105.99211683,102.82713561,null,null,null,"",null,null,null,null,null,null,null,null,null,null,null,null,null,null,null,"2024-04-04",97.388168037,131.28277876999999,104.13047025,154.47647950999999,null,null,"2024-04-04",0.03]
[null,null,null,null,null,"2024-06-07",16.853700742000001,855.53213200000005,1183.992178,"2024-03-01",974.19683262000001,null,"2024-04-08",97.725881666999996,111.07548541,106.03469119,102.62563351,null,null,null,"",null,null,null,null,null,null,null,null,null,null,null,null,null,null,null,"2024-04-05",95.995099312999997,129.46421785000001,102.87004555999999,150.53110774000001,null,null,"2024-04-05",0.03]
[null,null,null,null,null,"2024-06-14",16.883495146000001,1086.1631030000001,1152.1202407999999,"2024-03-08",960.20583092000004,null,"2024-04-09",97.092668610999993,111.96611735,106.07728274,101.93157069,null,null,null,"",null,null,null,null,null,null,null,null,null,null,null,null,null,null,null,"2024-04-08",97.725881666999996,132.84154527000001,105.00307196,159.33232169999999,null,null,"2024-04-08",0.05]
[null,null,null,null,null,"2024-06-21",17.618423757999999,872.777782,1155.9822766,"2024-03-15",990.93418399999996,null,"2024-04-10",96.459455555000005,110.38293354,106.11989136,103.09987584,null,null,null,"",null,null,null,null,null,null,null,null,null,null,null,null,null,null,null,"2024-04-09",97.092668610999993,130.76318993999999,104.42133748000001,161.60849772,null,null,"2024-04-09",0.05]
[null,null,null,null,null,"2024-06-28",18.254037693000001,809.113876,1167.2153139,"2024-03-22",979.11850907999997,null,"2024-04-11",96.543883961999995,109.81626023,106.16251715,103.32580244,null,null,null,"",null,null,null,null,null,null,null,null,null,null,null,null,null,null,null,"2024-04-10",96.459455555000005,124.26832951,103.83960301,157.20789074000001,null,null,"2024-04-10",0.05]
[null,null,null,null,null,"2024-07-05",17.876641919000001,836.17800299999999,1139.9327800999999,"2024-03-29",1011.665058,null,"2024-04-12",94.179888552999998,108.56612921,106.20516001,104.54499196,null,null,null,"",null,null,null,null,null,null,null,null,null,null,null,null,null,null,null,"2024-04-11",96.543883961999995,124.00853509,104.22742599,155.84218512999999,null,null,"2024-04-11",0.05]
[null,null,null,null,null,"2024-07-12",18.144791548000001,502.48014999999998,1097.664215,"2024-04-05",1058.4210293000001,null,"2024-04-15",97.472596444000004,108.03840989,106.24782005,105.32250513,null,null,null,"",null,null,null,null,null,null,null,null,null,null,null,null,null,null,null,"2024-04-12",94.179888552999998,124.26832951,101.90048811,154.32473444999999,null,null,"2024-04-12",0.05]
[null,null,null,null,null,"2024-07-19",18.661227870000001,779.41504599999996,1031.3624890999999,"2024-04-12",1034.0607378,null,"2024-04-16",94.644244794000002,107.22358265,106.29049714999999,107.13195334,null,null,null,"",null,null,null,null,null,null,null,null,null,null,null,null,null,null,null,"2024-04-15",97.472596444000004,124.61472206000001,105.58480643,155.08345979000001,null,null,"2024-04-15",0.05]
[null,null,null,null,null,"2024-07-26",18.194448886,1196.718654,992.56360791999998,"2024-04-19",1072.1771876,null,"2024-04-17",95.024172626999999,107.03612248,106.33319143,106.79408113,null,null,null,"",null,null,null,null,null,null,null,null,null,null,null,null,null,null,null,"2024-04-16",94.644244794000002,122.709563,102.67613407,152.50379362999999,null,null,"2024-04-16",0.05]
[null,null,null,null,null,"2024-08-02",17.211233580999998,1117.359322,998.11316838000005,"2024-04-26",1139.4643642000001,null,"2024-04-18",95.083272512999997,107.05769846,106.3759029,106.88160224000001,null,null,null,"",null,null,null,null,null,null,null,null,null,null,null,null,null,null,null,"2024-04-17",95.024172626999999,124.00853509,102.87004555999999,150.53110774000001,null,null,"2024-04-17",0.05]
[null,null,null,null,null,"2024-08-09",17.39,933.84583699999996,976.18349468999997,"2024-05-03",1141.1215853000001,null,"2024-04-19",97.362839515000005,107.85774232,106.41863143,106.38700616,null,null,null,"",null,null,null,null,null,null,null,null,null,null,null,null,null,null,null,"2024-04-18",95.083272512999997,123.05595556,103.35482429,150.83459787999999,null,null,"2024-04-18",0.05]
[null,null,null,null,null,"2024-08-16",17.22,845.838122,938.40378684999996,"2024-05-10",1180.5523929999999,null,"2024-04-22",99.389121294000006,108.24466176999999,106.46137714,105.92701144999999,null,null,null,"",null,null,null,null,null,null,null,null,null,null,null,null,null,null,null,"2024-04-19",97.362839515000005,127.12606809,106.45740813,156.75265554000001,null,null,"2024-04-19",0.05]
[null,null,null,null,null,"2024-08-23",18.28,907.01494400000001,893.19919569000001,"2024-05-17",1221.0085905000001,null,"2024-04-23",95.387214779999994,107.87823217,106.50414004,105.07826016,null,null,null,"",null,null,null,null,null,null,null,null,null,null,null,null,null,null,null,"2024-04-22",99.389121294000006,127.99204948000001,107.91174431,160.39453717999999,null,null,"2024-04-22",7.0000000000000007E-2]
[null,null,null,null,null,"2024-08-30",18.3,947.98738700000001,899.26341215000002,"2024-05-24",1228.8903312,null,"2024-04-24",93.006333687999998,107.52706867000001,106.54692012,105.00905741,null,null,null,"",null,null,null,null,null,null,null,null,null,null,null,null,null,null,null,"2024-04-23",95.387214779999994,124.87451648,104.71220472,138.08801213999999,null,null,"2024-04-23",7.0000000000000007E-2]
[null,null,null,null,null,"2024-09-06",18.170000000000002,1050.44031,914.25634892000005,"2024-05-31",1197.0670941999999,null,"2024-04-25",92.34779211,107.4450834,106.58971739,105.18613501999999,null,null,null,"",null,null,null,null,null,null,null,null,null,null,null,null,null,null,null,"2024-04-24",93.006333687999998,123.74874067,101.99744386,132.92867982000001,null,null,"2024-04-24",0.15]
[null,null,null,null,null,"2024-09-13",18.8,972.42466899999999,905.50723861999995,"2024-06-07",1183.992178,null,"2024-04-26",94.374073890000005,109.06624712999999,106.63253185000001,104.17862449,null,null,null,"",null,null,null,null,null,null,null,null,null,null,null,null,null,null,null,"2024-04-25",92.34779211,121.93017974999999,100.93093066,128.83156296999999,null,null,"2024-04-25",0.15]
[null,null,null,null,null,"2024-09-20",18.05,1304.3736779999999,938.70692292000001,"2024-06-14",1152.1202407999999,null,"2024-04-29",94.222102755999998,109.7778493,106.67536349,104.11959862,null,null,null,"",null,null,null,null,null,null,null,null,null,null,null,null,null,null,null,"2024-04-26",94.374073890000005,122.27657231000001,103.16091280000001,128.72258765000001,null,null,"2024-04-26",0.14000000000000001]
[null,null,null,null,null,"2024-09-27",18.48,482.34120899999999,913.57056392000004,"2024-06-21",1155.9822766,null,"2024-04-30",92.499763243999993,108.5472513,106.71821232000001,105.26551464000001,null,null,null,"",null,null,null,null,null,null,null,null,null,null,null,null,null,null,null,"2024-04-29",94.222102755999998,123.05595556,103.35482429,128.87956642,null,null,"2024-04-29",0.15]
[null,null,null,null,null,null,null,null,{"$error":"#N/A"},"2024-06-28",1167.2153139,null,"2024-05-01",null,null,null,null,null,null,null,"",null,null,null,null,null,null,null,null,null,null,null,null,null,null,null,"2024-04-30",92.499763243999993,120.54460953,102.57917833,124.17020345,null,null,"2024-04-30",0.15]
[null,null,null,null,null,null,null,null,{"$error":"#N/A"},"2024-07-05",1139.9327800999999,null,"2024-05-02",94.374073890000005,109.57998473000001,106.76107845999999,104.17862449,null,null,null,"",null,null,null,null,null,null,null,null,null,null,null,null,null,null,null,"2024-05-01",null,null,null,null,null,null,"2024-05-01"]
[null,null,null,null,null,null,null,null,{"$error":"#N/A"},"2024-07-12",1097.664215,null,"2024-05-03",99.591749472000004,110.77508537,106.80396177999999,103.12837109,null,null,null,"",null,null,null,null,null,null,null,null,null,null,null,null,null,null,null,"2024-05-02",94.374073890000005,121.41059092,105.1000277,125.26905481,null,null,"2024-05-02",0.15]
[null,null,null,null,null,null,null,null,{"$error":"#N/A"},"2024-07-19",1031.3624890999999,null,"2024-05-06",99.490435383999994,110.7380364,106.84686229,103.2484582,null,null,null,"",null,null,null,null,null,null,null,null,null,null,null,null,null,null,null,"2024-05-03",99.591749472000004,123.40234812,110.72346091999999,125.58301234,null,null,"2024-05-03",0.15]
[null,null,null,null,null,null,null,null,{"$error":"#N/A"},"2024-07-26",992.56360791999998,null,"2024-05-07",97.818752915000005,111.38004893,106.88977998999999,103.01031935,null,null,null,"",null,null,null,null,null,null,null,null,null,null,null,null,null,null,null,"2024-05-06",99.490435383999994,123.14255369999999,110.62650517,126.2109274,null,null,"2024-05-06",0.15]
[null,null,null,null,null,null,null,null,{"$error":"#N/A"},"2024-08-02",998.11316838000005,null,"2024-05-08",98.527951537999996,111.61314364,106.932715,103.57411817000001,null,null,null,"",null,null,null,null,null,null,null,null,null,null,null,null,null,null,null,"2024-05-07",97.818752915000005,121.49718906,109.65694772000001,125.73999111000001,null,null,"2024-05-07",0.15]
[null,null,null,null,null,null,null,null,{"$error":"#N/A"},"2024-08-09",976.18349468999997,null,"2024-05-09",98.021381093000002,110.49895938,106.97470709,104.97852679,null,null,null,"",null,null,null,null,null,null,null,null,null,null,null,null,null,null,null,"2024-05-08",98.527951537999996,121.75698346999999,109.94781496,126.52488493,null,null,"2024-05-08",0.15]
[null,null,null,null,null,null,null,null,{"$error":"#N/A"},"2024-08-16",938.40378684999996,null,"2024-05-10",96.957583158999995,109.99143684000001,107.01671561000001,104.74852944,null,null,null,"",null,null,null,null,null,null,null,null,null,null,null,null,null,null,null,"2024-05-09",98.021381093000002,120.19821697,109.26912474,125.58301234,null,null,"2024-05-09",0.15]
[null,null,null,null,null,null,null,null,{"$error":"#N/A"},"2024-08-23",893.19919569000001,null,"2024-05-13",97.818752915000005,110.47003912,107.05874067000001,104.64268995,null,null,null,"",null,null,null,null,null,null,null,null,null,null,null,null,null,null,null,"2024-05-10",96.957583158999995,119.85182442,107.62087707000001,124.95509728,null,null,"2024-05-10",0.15]
[null,null,null,null,null,null,null,null,{"$error":"#N/A"},"2024-08-30",899.26341215000002,null,"2024-05-14",97.818752915000005,110.78096424,107.10078215999999,104.52870896,null,null,null,"",null,null,null,null,null,null,null,null,null,null,null,null,null,null,null,"2024-05-13",97.818752915000005,122.44976859000001,108.88130176,125.26905481,null,null,"2024-05-13",0.15]
[null,null,null,null,null,null,null,null,{"$error":"#N/A"},"2024-09-06",914.25634892000005,null,"2024-05-15",100.55423331,110.36039212,107.14284019999999,104.66507907,null,null,null,"",null,null,null,null,null,null,null,null,null,null,null,null,null,null,null,"2024-05-14",97.818752915000005,120.37141325,108.68739026999999,124.01322469,null,null,"2024-05-14",0.15]
[null,null,null,null,null,null,null,null,{"$error":"#N/A"},"2024-09-13",905.50723861999995,null,"2024-05-16",103.07194278,110.5810912,107.18491478,104.35366672000001,null,null,null,"",null,null,null,null,null,null,null,null,null,null,null,null,null,null,null,"2024-05-15",100.55423331,119.42541120999999,111.01432815,124.48416098,null,null,"2024-05-15",0.15]
[null,null,null,null,null,null,null,null,{"$error":"#N/A"},"2024-09-20",938.70692292000001,null,"2024-05-17",100.45146966,110.46652214,107.22700592,104.12366937,null,null,null,"",null,null,null,null,null,null,null,null,null,null,null,null,null,null,null,"2024-05-16",103.07194278,121.34279166,112.69038817000001,125.11207605,null,null,"2024-05-16",0.15]
[null,null,null,null,null,null,null,null,{"$error":"#N/A"},"2024-09-27",913.57056392000004,null,"2024-05-20",99.064160365999996,110.12190126,107.26911346999999,103.97712238,null,null,null,"",null,null,null,null,null,null,null,null,null,null,null,null,null,null,null,"2024-05-17",100.45146966,122.34713381,111.40869522,124.95509728,null,null,"2024-05-17",0.13]
[null,null,null,null,null,null,null,null,{"$error":"#N/A"},null,null,null,"2024-05-21",97.368560110999994,109.82936271,107.31123758,103.87942439,null,null,null,"",null,null,null,null,null,null,null,null,null,null,null,null,null,null,null,"2024-05-20",99.064160365999996,122.98626062,109.92981872999999,127.93769382000001,null,null,"2024-05-20",0.12]
[null,null,null,null,null,null,null,null,{"$error":"#N/A"},null,null,null,"2024-05-22",95.364668899999998,108.31092408000001,107.35337823,104.82587368,null,null,null,"",null,null,null,null,null,null,null,null,null,null,null,null,null,null,null,"2024-05-21",97.368560110999994,124.0819066,108.54953401,130.13539653999999,null,null,"2024-05-21",0.12]
[null,null,null,null,null,null,null,null,{"$error":"#N/A"},null,null,null,"2024-05-23",94.799468814999997,107.51733664,107.39553544,104.70578657,null,null,null,"",null,null,null,null,null,null,null,null,null,null,null,null,null,null,null,"2024-05-22",95.364668899999998,121.61670316,106.38051517,128.25165136000001,null,null,"2024-05-22",0.12]
[null,null,null,null,null,null,null,null,{"$error":"#N/A"},null,null,null,"2024-05-24",96.186778114999996,107.15199316,107.43770919000001,104.83808593000001,null,null,null,"",null,null,null,null,null,null,null,null,null,null,null,null,null,null,null,"2024-05-23",94.799468814999997,119.60801887,105.59178104,126.05394864,null,null,"2024-05-23",0.12]
[null,null,null,null,null,null,null,null,{"$error":"#N/A"},null,null,null,"2024-05-27",95.107759771000005,107.31586888,107.47989948999999,105.23701939,null,null,null,"",null,null,null,null,null,null,null,null,null,null,null,null,null,null,null,"2024-05-24",96.186778114999996,122.52974147,107.95798342000001,124.48416098,null,null,"2024-05-24",0.13]
[null,null,null,null,null,null,null,null,{"$error":"#N/A"},null,null,null,"2024-05-28",94.902232467000005,106.69855278999999,107.52210647,104.89914717000001,null,null,null,"",null,null,null,null,null,null,null,null,null,null,null,null,null,null,null,"2024-05-27",95.107759771000005,121.98191848,107.26784105999999,125.73999111000001,null,null,"2024-05-27",0.13]
[null,null,null,null,null,null,null,null,{"$error":"#N/A"},null,null,null,"2024-05-29",93.720450471000007,105.77425957,107.56433,105.78249984,null,null,null,"",null,null,null,null,null,null,null,null,null,null,null,null,null,null,null,"2024-05-28",94.902232467000005,121.52539932000001,105.98614809999999,124.17020345,null,null,"2024-05-28",0.13]
[null,null,null,null,null,null,null,null,{"$error":"#N/A"},null,null,null,"2024-05-30",null,null,null,null,null,null,null,"",null,null,null,null,null,null,null,null,null,null,null,null,null,null,null,"2024-05-29",93.720450471000007,120.79496867,105.59178104,121.97250074,null,null,"2024-05-29",0.12]
[null,null,null,null,null,null,null,null,{"$error":"#N/A"},null,null,null,"2024-05-31",93.052486733999999,105.24913488999999,107.60657007,106.68620626000001,null,null,null,"",null,null,null,null,null,null,null,null,null,null,null,null,null,null,null,"2024-05-30",null,null,null,null,null,null,"2024-05-30"]
[null,null,null,null,null,null,null,null,{"$error":"#N/A"},null,null,null,"2024-06-03",90.380631785999995,105.19180295,107.6488267,106.59868514,null,null,null,"",null,null,null,null,null,null,null,null,null,null,null,null,null,null,null,"2024-05-31",93.052486733999999,119.42541120999999,105.59178104,118.83292543,null,null,"2024-05-31",0.11]
[null,null,null,null,null,null,null,null,{"$error":"#N/A"},null,null,null,"2024-06-04",89.352995268000001,104.99395561999999,107.69110000000001,107.23779284,null,null,null,"",null,null,null,null,null,null,null,null,null,null,null,null,null,null,null,"2024-06-03",90.380631785999995,115.86456179,102.92980337,118.98990419,null,null,"2024-06-03",0.11]
[null,null,null,null,null,null,null,null,{"$error":"#N/A"},null,null,null,"2024-06-05",88.633649704999996,104.65369647999999,107.73338984999999,107.55124056,null,null,null,"",null,null,null,null,null,null,null,null,null,null,null,null,null,null,null,"2024-06-04",89.352995268000001,114.129789,102.14106923999999,117.42011654,null,null,"2024-06-04",0.11]
[null,null,null,null,null,null,null,null,{"$error":"#N/A"},null,null,null,"2024-06-06",88.787795183,105.93935071999999,107.77569638,107.22558059000001,null,null,null,"",null,null,null,null,null,null,null,null,null,null,null,null,null,null,null,"2024-06-05",88.633649704999996,113.85587750000001,100.46500922,114.43752000000001,null,null,"2024-06-05",0.1]
[null,null,null,null,null,null,null,null,{"$error":"#N/A"},null,null,null,"2024-06-07",87.194958579000001,104.10189275,107.81801944999999,107.47186094,null,null,null,"",null,null,null,null,null,null,null,null,null,null,null,null,null,null,null,"2024-06-06",88.787795183,115.77325796,100.36641745999999,114.90845629,null,null,"2024-06-06",0.05]
[null,null,null,null,null,null,null,null,{"$error":"#N/A"},null,null,null,"2024-06-10",86.578376668999994,104.09527255,107.8603592,109.23042478000001,null,null,null,"",null,null,null,null,null,null,null,null,null,null,null,null,null,null,null,"2024-06-07",87.194958579000001,113.58196601,98.591765680999998,112.71075358,null,null,"2024-06-07",0.04]
[null,null,null,null,null,null,null,null,{"$error":"#N/A"},null,null,null,"2024-06-11",88.633649704999996,104.85000082000001,107.9027155,108.94140154999999,null,null,null,"",null,null,null,null,null,null,null,null,null,null,null,null,null,null,null,"2024-06-10",86.578376668999994,112.76023153,98.295990384000007,110.67002963,null,null,"2024-06-10",0.12]
[null,null,null,null,null,null,null,null,{"$error":"#N/A"},null,null,null,"2024-06-12",89.250231615999994,103.38542025,107.94508848,109.68838411,null,null,null,"",null,null,null,null,null,null,null,null,null,null,null,null,null,null,null,"2024-06-11",88.633649704999996,112.21240854,99.774866868999993,111.92585975,null,null,"2024-06-11",0.12]
[null,null,null,null,null,null,null,null,{"$error":"#N/A"},null,null,null,"2024-06-13",89.044704312999997,103.06778011999999,107.98747813999999,109.85732022000001,null,null,null,"",null,null,null,null,null,null,null,null,null,null,null,null,null,null,null,"2024-06-12",89.250231615999994,108.74286296,99.873458635000006,110.67002963,null,null,"2024-06-12",0.12]
[null,null,null,null,null,null,null,null,{"$error":"#N/A"},null,null,null,"2024-06-14",87.349104057000005,103.14954127,108.02988434,109.15715127999999,null,null,null,"",null,null,null,null,null,null,null,null,null,null,null,null,null,null,null,"2024-06-13",89.044704312999997,108.65155912,99.577683338,112.39679605000001,null,null,"2024-06-13",0.11]
[null,null,null,null,null,null,null,null,{"$error":"#N/A"},null,null,null,"2024-06-17",86.783903972000005,102.69740253000001,108.07230722,110.17483869,null,null,null,"",null,null,null,null,null,null,null,null,null,null,null,null,null,null,null,"2024-06-14",87.349104057000005,109.83850893,98.493173915,112.71075358,null,null,"2024-06-14",0.11]
[null,null,null,null,null,null,null,null,{"$f":"IFERROR(VLOOKUP(F203,$J$11:$K$607,2,0),NA())","v":{"$error":"#N/A"}},null,null,null,"2024-06-18",87.246340406000002,103.12200884000001,108.11474677,110.0608577,null,null,null,"",null,null,null,null,null,null,null,null,null,null,null,null,null,null,null,"2024-06-17",86.783903972000005,108.74286296,97.605848023999997,111.45492345,null,null,"2024-06-17",0.11]
[null,null,null,null,null,null,null,null,{"$error":"#N/A"},null,null,null,"2024-06-19",88.530886053000003,103.66584764,108.15720301,111.22712747,null,null,null,{"$f":"IF(S204=\"\",\"\",IF(T204=\"\",NA(),T204-V204))","v":""},null,null,null,null,null,null,null,null,null,null,null,null,null,null,null,"2024-06-18",87.246340406000002,118.60367673,98.394582150000005,113.4956474,null,null,"2024-06-18",0.11]
[null,null,null,null,null,null,null,null,{"$error":"#N/A"},null,null,null,"2024-06-20",89.404377093999997,103.82494785999999,108.19967592,110.42722517,null,null,null,"",null,null,null,null,null,null,null,null,null,null,null,null,null,null,null,"2024-06-19",88.530886053000003,116.41238478,99.873458635000006,115.22241382,null,null,"2024-06-19",7.0000000000000007E-2]
[null,null,null,null,null,null,null,null,{"$error":"#N/A"},null,null,null,"2024-06-21",91.151359174999996,104.59663175999999,108.2421655,110.75695589,null,null,null,"",null,null,null,null,null,null,null,null,null,null,null,null,null,null,null,"2024-06-20",89.404377093999997,118.69498056,100.95796805000001,119.46084049,null,null,"2024-06-20",7.0000000000000007E-2]
[null,null,null,null,null,null,null,null,{"$error":"#N/A"},null,null,null,"2024-06-24",91.716559259999997,105.71364339,108.28467175999999,109.91023997000001,null,null,null,"",null,null,null,null,null,null,null,null,null,null,null,null,null,null,null,"2024-06-21",91.151359174999996,115.49934647000001,101.94388571,118.36198913,null,null,"2024-06-21",0.06]
[null,null,null,null,null,null,null,null,{"$error":"#N/A"},null,null,null,"2024-06-25",91.665177434,105.4502406,108.32719470000001,110.50049866000001,null,null,null,"",null,null,null,null,null,null,null,null,null,null,null,null,null,null,null,"2024-06-24",91.716559259999997,116.04716945,102.5354363,120.71667060999999,null,null,"2024-06-24",0.05]
[null,null,null,null,null,null,null,null,{"$error":"#N/A"},null,null,null,"2024-06-26",93.566304993000003,105.71738449,108.36973431,112.14304614,null,null,null,"",null,null,null,null,null,null,null,null,null,null,null,null,null,null,null,"2024-06-25",91.665177434,114.76891582,102.5354363,118.36198913,null,null,"2024-06-25",0.05]
[null,null,null,null,null,null,null,null,{"$error":"#N/A"},null,null,null,"2024-06-27",93.823214123,107.15394129000001,108.41229060000001,112.41171561,null,null,null,"",null,null,null,null,null,null,null,null,null,null,null,null,null,null,null,"2024-06-26",93.566304993000003,114.49500432000001,103.71853749,122.28645827,null,null,"2024-06-26",0.05]
[null,null,null,null,null,null,null,null,{"$error":"#N/A"},null,null,null,"2024-06-28",94.439796033999997,106.80803602,108.4548637,113.14445055,null,null,null,"",null,null,null,null,null,null,null,null,null,null,null,null,null,null,null,"2024-06-27",93.823214123,117.78194225,104.80304691000001,125.58301234,null,null,"2024-06-27",0.05]
[null,null,null,null,null,null,null,null,{"$error":"#N/A"},null,null,null,"2024-07-01",94.131505078000004,107.50757012,108.49745347,113.76320449000001,null,null,null,"",null,null,null,null,null,null,null,null,null,null,null,null,null,null,null,"2024-06-28",94.439796033999997,117.87324608,105.00023045,124.17020345,null,null,"2024-06-28",0.05]
[null,null,null,null,null,null,null,null,{"$error":"#N/A"},null,null,null,"2024-07-02",94.953614293000001,107.56705707,108.54005991,115.35893833999999,null,null,null,"",null,null,null,null,null,null,null,null,null,null,null,null,null,null,null,"2024-07-01",94.131505078000004,117.87324608,105.39459751,123.54228839,null,null,"2024-07-01",0.06]
[null,null,null,null,null,null,null,null,{"$error":"#N/A"},null,null,null,"2024-07-03",94.234268729999997,108.32114745,108.58268316,113.70214325000001,null,null,null,"",null,null,null,null,null,null,null,null,null,null,null,null,null,null,null,"2024-07-02",94.953614293000001,118.60367673,106.67629046,125.11207605,null,null,"2024-07-02",0.06]
[null,null,null,null,null,null,null,null,{"$error":"#N/A"},null,null,null,"2024-07-04",93.720450471000007,108.75395143,108.62532308999999,111.61791943999999,null,null,null,"",null,null,null,null,null,null,null,null,null,null,null,null,null,null,null,"2024-07-03",94.234268729999997,120.06453802999999,105.69037281,125.42603358,null,null,"2024-07-03",0.05]
[null,null,null,null,null,null,null,null,{"$error":"#N/A"},null,null,null,"2024-07-05",92.487286648999998,108.84279826,108.66797982,111.88455354,null,null,null,"",null,null,null,null,null,null,null,null,null,null,null,null,null,null,null,"2024-07-04",93.720450471000007,121.34279166,105.29600574,127.93769382000001,null,null,"2024-07-04",0.05]
[null,null,null,null,null,null,null,null,{"$error":"#N/A"},null,null,null,"2024-07-08",91.459650131000004,109.08527158,108.71065335999999,111.37570983000001,null,null,null,"",null,null,null,null,null,null,null,null,null,null,null,null,null,null,null,"2024-07-05",92.487286648999998,118.87758822000001,104.40867985,125.42603358,null,null,"2024-07-05",0.05]
[null,null,null,null,null,null,null,null,{"$error":"#N/A"},null,null,null,"2024-07-09",92.024850216000004,109.5678908,108.75334357,110.69793002,null,null,null,"",null,null,null,null,null,null,null,null,null,null,null,null,null,null,null,"2024-07-08",91.459650131000004,118.42106905999999,103.81712926,123.54228839,null,null,"2024-07-08",0.06]
[null,null,null,null,null,null,null,null,{"$error":"#N/A"},null,null,null,"2024-07-10",91.870704738000001,109.66272856000001,108.79605058,109.8430726,null,null,null,"",null,null,null,null,null,null,null,null,null,null,null,null,null,null,null,"2024-07-09",92.024850216000004,118.87758822000001,104.01431279000001,125.89696987000001,null,null,"2024-07-09",0.06]
[null,null,null,null,null,null,null,null,{"$error":"#N/A"},null,null,null,"2024-07-11",93.103868559999995,110.58970262,108.83877440000001,110.11377745,null,null,null,"",null,null,null,null,null,null,null,null,null,null,null,null,null,null,null,"2024-07-10",91.870704738000001,117.69063841000001,103.71853749,124.32718222,null,null,"2024-07-10",0.06]
[null,null,null,null,null,null,null,null,{"$error":"#N/A"},null,null,null,"2024-07-12",93.874595948999996,111.10981044,108.88151489000001,110.98695324000001,null,null,null,"",null,null,null,null,null,null,null,null,null,null,null,null,null,null,null,"2024-07-11",93.103868559999995,119.60801887,105.09882220999999,125.58301234,null,null,"2024-07-11",0.06]
[null,null,null,null,null,null,null,null,{"$error":"#N/A"},null,null,null,"2024-07-15",95.570196203999998,111.47528321999999,108.92427219,111.05615598999999,null,null,null,"",null,null,null,null,null,null,null,null,null,null,null,null,null,null,null,"2024-07-12",93.874595948999996,121.89061465,105.78896457,126.52488493,null,null,"2024-07-12",0.06]
[null,null,null,null,null,null,null,null,{"$error":"#N/A"},null,null,null,"2024-07-16",97.625469240000001,111.29376225,108.96704629,110.46793267,null,null,null,"",null,null,null,null,null,null,null,null,null,null,null,null,null,null,null,"2024-07-15",95.570196203999998,122.89495678999999,108.74671754000001,128.25165136000001,null,null,"2024-07-15",0.04]
[null,null,null,null,null,null,null,null,{"$error":"#N/A"},null,null,null,"2024-07-17",97.728232891999994,111.58679214999999,109.00983720000001,111.27394108999999,null,null,null,"",null,null,null,null,null,null,null,null,null,null,null,null,null,null,null,"2024-07-16",97.625469240000001,119.60801887,109.92981872999999,127.78071506000001,null,null,"2024-07-16",0.04]
[null,null,null,null,null,null,null,null,{"$error":"#N/A"},null,null,null,"2024-07-18",95.981250810999995,110.03668347,109.0526449,112.81268445000001,null,null,null,"",null,null,null,null,null,null,null,null,null,null,null,null,null,null,null,"2024-07-17",97.728232891999994,120.33844952,110.12700226,134.21684443999999,null,null,"2024-07-17",0.04]
[null,null,null,null,null,null,null,null,{"$error":"#N/A"},null,null,null,"2024-07-19",96.546450895999996,110.0059961,109.09546942,113.0508233,null,null,null,"",null,null,null,null,null,null,null,null,null,null,null,null,null,null,null,"2024-07-18",95.981250810999995,115.40804263,108.35235048,131.86216296000001,null,null,"2024-07-18",0.04]
[null,null,null,null,null,null,null,null,{"$error":"#N/A"},null,null,null,"2024-07-22",97.060269156000004,110.2156098,109.13831073,113.16276892,null,null,null,"",null,null,null,null,null,null,null,null,null,null,null,null,null,null,null,"2024-07-19",96.546450895999996,115.40804263,109.04249283999999,133.90288691000001,null,null,"2024-07-19",0.04]
[null,null,null,null,null,null,null,null,{"$error":"#N/A"},null,null,null,"2024-07-23",92.692813952999998,109.12104477,109.18116885000001,113.58816226,null,null,null,"",null,null,null,null,null,null,null,null,null,null,null,null,null,null,null,"2024-07-22",97.060269156000004,115.77325796,109.7326352,134.37382321000001,null,null,"2024-07-22",0.04]
[null,null,null,null,null,null,null,null,{"$error":"#N/A"},null,null,null,"2024-07-24",92.230377520000005,108.97699516,109.2240439,114.68522928,null,null,null,"",null,null,null,null,null,null,null,null,null,null,null,null,null,null,null,"2024-07-23",92.692813952999998,109.92981276,104.21149631999999,130.13539653999999,null,null,"2024-07-23",0.05]
[null,null,null,null,null,null,null,null,{"$error":"#N/A"},null,null,null,"2024-07-25",94.131505078000004,108.57302525,109.26693576,114.79921027,null,null,null,"",null,null,null,null,null,null,null,null,null,null,null,null,null,null,null,"2024-07-24",92.230377520000005,109.47329361,103.22557866,127.30977876,null,null,"2024-07-24",0.05]
[null,null,null,null,null,null,null,null,{"$error":"#N/A"},null,null,null,"2024-07-26",94.131505078000004,109.89913337,109.30984442,114.92743888,null,null,null,"",null,null,null,null,null,null,null,null,null,null,null,null,null,null,null,"2024-07-25",94.131505078000004,109.19938211,105.09882220999999,129.97841778,null,null,"2024-07-25",0.05]
[null,null,null,null,null,null,null,null,{"$error":"#N/A"},null,null,null,"2024-07-29",93.103868559999995,109.43483175,109.35277000000001,114.95593413,null,null,null,"",null,null,null,null,null,null,null,null,null,null,null,null,null,null,null,"2024-07-26",94.131505078000004,109.83850893,104.70445515,99.367558518999999,null,null,"2024-07-26",0.06]
[null,null,null,null,null,null,null,null,{"$error":"#N/A"},null,null,null,"2024-07-30",92.641432127000002,108.73259957,109.39571239999999,115.06380900000001,null,null,null,"",null,null,null,null,null,null,null,null,null,null,null,null,null,null,null,"2024-07-29",93.103868559999995,108.83416679,104.21149631999999,94.972153086999995,null,null,"2024-07-29",0.05]
[null,null,null,null,null,null,null,null,{"$error":"#N/A"},null,null,null,"2024-07-31",93.823214123,110.03646797,109.43867159,115.24495735000001,null,null,null,"",null,null,null,null,null,null,null,null,null,null,null,null,null,null,null,"2024-07-30",92.641432127000002,107.00809015999999,103.61994573,99.367558518999999,null,null,"2024-07-30",0.04]
[null,null,null,null,null,null,null,null,{"$error":"#N/A"},null,null,null,"2024-08-01",93.360777690000006,109.81518273,109.48164772,115.36707984,null,null,null,"",null,null,null,null,null,null,null,null,null,null,null,null,null,null,null,"2024-07-31",93.823214123,108.2863438,104.80304691000001,97.640792098999995,null,null,"2024-07-31",0.04]
[null,null,null,null,null,null,null,null,{"$error":"#N/A"},null,null,null,"2024-08-02",89.044704312999997,108.48682477,109.52464078,116.76131159000001,null,null,null,"",null,null,null,null,null,null,null,null,null,null,null,null,null,null,null,"2024-08-01",93.360777690000006,104.45158289,104.50727162,96.227983210000005,null,null,"2024-08-01",0.04]
[null,null,null,null,null,null,null,null,{"$error":"#N/A"},null,null,null,"2024-08-05",88.479504227999996,107.98293989,109.56765064,117.33121654,null,null,null,"",null,null,null,null,null,null,null,null,null,null,null,null,null,null,null,"2024-08-02",89.044704312999997,103.62984840999999,100.46500922,93.245386667000005,null,null,"2024-08-02",0.04]
[null,null,null,null,null,null,null,null,{"$error":"#N/A"},null,null,null,"2024-08-06",88.376740576000003,108.84249655000001,109.61067743,115.0556675,null,null,null,"",null,null,null,null,null,null,null,null,null,null,null,null,null,null,null,"2024-08-05",88.479504227999996,103.62984840999999,98.788949212000006,91.204662716000001,null,null,"2024-08-05",0.04]
[null,null,null,null,null,null,null,null,{"$error":"#N/A"},null,null,null,"2024-08-07",88.017067793999999,109.91757165,109.65372116,114.17027945,null,null,null,"",null,null,null,null,null,null,null,null,null,null,null,null,null,null,null,"2024-08-06",88.376740576000003,102.89941776000001,98.788949212000006,90.576747654000002,null,null,"2024-08-06",7.0000000000000007E-2]
[null,null,null,null,null,null,null,null,{"$error":"#N/A"},null,null,null,"2024-08-08",89.301613442000004,110.90629111,109.69678168999999,114.33107406000001,null,null,null,"",null,null,null,null,null,null,null,null,null,null,null,null,null,null,null,"2024-08-07",88.017067793999999,103.26463308,98.197398617999994,89.948832593000006,null,null,"2024-08-07",7.0000000000000007E-2]
[null,null,null,null,null,null,null,null,{"$error":"#N/A"},null,null,null,"2024-08-09",89.969577178999998,112.59039842999999,109.73985913999999,112.17968288,null,null,null,"",null,null,null,null,null,null,null,null,null,null,null,null,null,null,null,"2024-08-08",89.301613442000004,104.08636756,99.281908040999994,91.518620247000001,null,null,"2024-08-08",7.0000000000000007E-2]
[null,null,null,null,null,null,null,null,{"$error":"#N/A"},null,null,null,"2024-08-12",91.056041308000005,113.02253004000001,109.78295353,111.76446642000001,null,null,null,"",null,null,null,null,null,null,null,null,null,null,null,null,null,null,null,"2024-08-09",89.969577178999998,106.73417867000001,100.36641745999999,93.402365431999996,null,null,"2024-08-09",7.0000000000000007E-2]
[null,null,null,null,null,null,null,null,{"$error":"#N/A"},null,null,null,"2024-08-13",90.590413823999995,114.12768049,109.82606484999999,111.69119293,null,null,null,"",null,null,null,null,null,null,null,null,null,null,null,null,null,null,null,"2024-08-12",91.056041308000005,106.64287484,100.9626536,95.129131852,null,null,"2024-08-12",0.05]
[null,null,null,null,null,null,null,null,{"$error":"#N/A"},null,null,null,"2024-08-14",90.021313566000003,114.92045764,109.8691931,110.93199812,null,null,null,"",null,null,null,null,null,null,null,null,null,null,null,null,null,null,null,"2024-08-13",90.590413823999995,111.29937022999999,100.56516284,98.111728395,null,null,"2024-08-13",0.05]
[null,null,null,null,null,null,null,null,{"$error":"#N/A"},null,null,null,"2024-08-15",90.021313566000003,115.64088674,109.91233828999999,111.23526897000001,null,null,null,"",null,null,null,null,null,null,null,null,null,null,null,null,null,null,null,"2024-08-14",90.021313566000003,106.82548250000001,100.26704477,95.600068148000005,null,null,"2024-08-14",0.05]
[null,null,null,null,null,null,null,null,{"$error":"#N/A"},null,null,null,"2024-08-16",89.090058597999999,115.46833925,109.95550040000001,111.19659685000001,null,null,null,"",null,null,null,null,null,null,null,null,null,null,null,null,null,null,null,"2024-08-15",90.021313566000003,105.18201354,100.9626536,97.012877036999996,null,null,"2024-08-15",0.04]
[null,null,null,null,null,null,null,null,{"$error":"#N/A"},null,null,null,"2024-08-19",91.314723244000007,117.0412652,109.99867944,110.3926238,null,null,null,"",null,null,null,null,null,null,null,null,null,null,null,null,null,null,null,"2024-08-16",89.090058597999999,103.26463308,99.968926701000001,95.443089383,null,null,"2024-08-16",0.04]
[null,null,null,null,null,null,null,null,{"$error":"#N/A"},null,null,null,"2024-08-20",91.832087114999993,117.30799533,110.04187542,111.02358999,null,null,null,"",null,null,null,null,null,null,null,null,null,null,null,null,null,null,null,"2024-08-19",91.314723244000007,109.65590127,102.35387127,102.03619753,null,null,"2024-08-19",0.04]
[null,null,null,null,null,null,null,null,{"$error":"#N/A"},null,null,null,"2024-08-21",95.350161438000001,117.632316,110.08508845,111.34924995999999,null,null,null,"",null,null,null,null,null,null,null,null,null,null,null,null,null,null,null,"2024-08-20",91.832087114999993,108.56025529,102.15512588999999,101.25130369999999,null,null,"2024-08-20",0.04]
[null,null,null,null,null,null,null,null,{"$error":"#N/A"},null,null,null,"2024-08-22",94.574115632000002,116.52010574000001,110.12831842,113.01215118,null,null,null,"",null,null,null,null,null,null,null,null,null,null,null,null,null,null,null,"2024-08-21",95.350161438000001,112.57762387,105.93128813,104.23390024,null,null,"2024-08-21",0.05]
[null,null,null,null,null,null,null,null,{"$error":"#N/A"},null,null,null,"2024-08-23",94.574115632000002,116.89514677,110.17156531000001,112.48091836,null,null,null,"",null,null,null,null,null,null,null,null,null,null,null,null,null,null,null,"2024-08-22",94.574115632000002,110.75154723999999,104.44069777,100.62338864,null,null,"2024-08-22",0.04]
[null,null,null,null,null,null,null,null,{"$error":"#N/A"},null,null,null,"2024-08-26",95.298425050999995,117.99871975000001,110.21482927,111.78482017,null,null,null,"",null,null,null,null,null,null,null,null,null,null,null,null,null,null,null,"2024-08-23",94.574115632000002,111.84719321999999,104.83818853,103.29202764999999,null,null,"2024-08-23",0.04]
[null,null,null,null,null,null,null,null,{"$error":"#N/A"},null,null,null,"2024-08-27",94.522379244000007,117.90148560999999,110.25811014999999,111.88251816,null,null,null,"",null,null,null,null,null,null,null,null,null,null,null,null,null,null,null,"2024-08-26",95.298425050999995,111.57328172,105.53379737,103.60598518,null,null,"2024-08-26",0.04]
[null,null,null,null,null,null,null,null,{"$error":"#N/A"},null,null,null,"2024-08-28",93.435915115,118.39114741,110.30140809,112.58675785,null,null,null,"",null,null,null,null,null,null,null,null,null,null,null,null,null,null,null,"2024-08-27",94.522379244000007,112.21240854,104.04320701,101.40828246,null,null,"2024-08-27",0.05]
[null,null,null,null,null,null,null,null,{"$error":"#N/A"},null,null,null,"2024-08-29",95.557106986999997,117.26829139,110.34472297000001,114.70965378,null,null,null,"",null,null,null,null,null,null,null,null,null,null,null,null,null,null,null,"2024-08-28",93.435915115,108.74286296,102.65198934,97.954749629999995,null,null,"2024-08-28",0.05]
[null,null,null,null,null,null,null,null,{"$error":"#N/A"},null,null,null,"2024-08-30",94.677588405999998,117.23610413,110.3880549,115.12487024000001,null,null,null,"",null,null,null,null,null,null,null,null,null,null,null,null,null,null,null,"2024-08-29",95.557106986999997,108.92547062,104.54007046,97.797770864,null,null,"2024-08-29",0.05]
[null,null,null,null,null,null,null,null,{"$error":"#N/A"},null,null,null,"2024-09-02",94.781061179999995,116.28967462999999,110.43140389,114.4491258,null,null,null,"",null,null,null,null,null,null,null,null,null,null,null,null,null,null,null,"2024-08-30",94.677588405999998,108.2863438,104.24195238999999,97.797770864,null,null,"2024-08-30",0.04]
[null,null,null,null,null,null,null,null,{"$error":"#N/A"},null,null,null,"2024-09-03",91.573405179000005,115.81333942000001,110.47476981,114.43691355,null,null,null,"",null,null,null,null,null,null,null,null,null,null,null,null,null,null,null,"2024-09-02",94.781061179999995,107.28200166000001,103.64571625000001,96.698919505999996,null,null,"2024-09-02",0.04]
[null,null,null,null,null,null,null,null,{"$error":"#N/A"},null,null,null,"2024-09-04",94.367170083000005,117.32809727999999,110.51815279,114.71168915,null,null,null,"",null,null,null,null,null,null,null,null,null,null,null,null,null,null,null,"2024-09-03",91.573405179000005,103.44724075000001,101.06202629000001,93.559344198000005,null,null,"2024-09-03",0.05]
[null,null,null,null,null,null,null,null,{"$error":"#N/A"},null,null,null,"2024-09-05",95.194952276999999,117.66579627,110.56155283,114.08072296,null,null,null,"",null,null,null,null,null,null,null,null,null,null,null,null,null,null,null,"2024-09-04",94.367170083000005,104.08636756,104.73881584,95.443089383,null,null,"2024-09-04",0.05]
[null,null,null,null,null,null,null,null,{"$error":"#N/A"},null,null,null,"2024-09-06",94.005015373000006,116.0020926,110.60496992,113.37444790000001,null,null,null,"",null,null,null,null,null,null,null,null,null,null,null,null,null,null,null,"2024-09-05",95.194952276999999,105.27331737,105.03693392,95.443089383,null,null,"2024-09-05",0.04]
[null,null,null,null,null,null,null,null,{"$error":"#N/A"},null,null,null,"2024-09-09",95.712316147999999,116.1441165,110.64840408000001,114.17842095,null,null,null,"",null,null,null,null,null,null,null,null,null,null,null,null,null,null,null,"2024-09-06",94.005015373000006,105.91244419,104.1425797,94.030280493999996,null,null,"2024-09-06",0.04]
[null,null,null,null,null,null,null,null,{"$error":"#N/A"},null,null,null,"2024-09-10",95.660579760999994,115.78411745,110.69185529000001,114.49797479999999,null,null,null,"",null,null,null,null,null,null,null,null,null,null,null,null,null,null,null,"2024-09-09",95.712316147999999,104.72549438,106.42815158000001,91.675599012999996,null,null,"2024-09-09",0.04]
[null,null,null,null,null,null,null,null,{"$error":"#N/A"},null,null,null,"2024-09-11",96.074470857999998,116.09199968999999,110.73532356,114.76867965,null,null,null,"",null,null,null,null,null,null,null,null,null,null,null,null,null,null,null,"2024-09-10",95.660579760999994,102.7168101,105.73254274999999,90.576747654000002,null,null,"2024-09-10",0.04]
[null,null,null,null,null,null,null,null,{"$error":"#N/A"},null,null,null,"2024-09-12",96.229680019,115.53400677,110.77880888999999,115.10858724000001,null,null,null,"",null,null,null,null,null,null,null,null,null,null,null,null,null,null,null,"2024-09-11",96.074470857999998,105.82114036,106.62689696,92.774450371,null,null,"2024-09-11",0.04]
[null,null,null,null,null,null,null,null,{"$error":"#N/A"},null,null,null,"2024-09-13",97.264407761000001,116.26888307,110.82231127999999,113.40497852,null,null,null,"",null,null,null,null,null,null,null,null,null,null,null,null,null,null,null,"2024-09-12",96.229680019,105.27331737,105.83191544,92.774450371,null,null,"2024-09-12",0.04]
[null,null,null,null,null,null,null,null,{"$f":"IFERROR(VLOOKUP(F267,$J$11:$K$607,2,0),NA())","v":{"$error":"#N/A"}},null,null,null,"2024-09-16",95.608843374000003,116.47254894,110.86583072000001,112.36693737,null,null,null,"",null,null,null,null,null,null,null,null,null,null,null,null,null,null,null,"2024-09-13",97.264407761000001,108.65155912,107.02438773,96.855898272000005,null,null,"2024-09-13",0.04]
[null,null,null,null,null,null,null,null,{"$error":"#N/A"},null,null,null,"2024-09-17",95.815788921999996,116.33632632,110.90936723,111.96596853,null,null,null,{"$f":"IF(S268=\"\",\"\",IF(T268=\"\",NA(),T268-V268))","v":""},null,null,null,null,null,null,null,null,null,null,null,null,null,null,null,"2024-09-16",95.608843374000003,108.74286296,105.33505199,94.972153086999995,null,null,"2024-09-16",0.04]
[null,null,null,null,null,null,null,null,{"$error":"#N/A"},null,null,null,"2024-09-18",95.298425050999995,115.29114555,110.95292092,111.47137245,null,null,null,"",null,null,null,null,null,null,null,null,null,null,null,null,null,null,null,"2024-09-17",95.815788921999996,109.7472051,106.52752427,95.600068148000005,null,null,"2024-09-17",0.04]
[null,null,null,null,null,null,null,null,{"$error":"#N/A"},null,null,null,"2024-09-19",95.453634211999997,114.75237534,110.99748792,110.29492581,null,null,null,"",null,null,null,null,null,null,null,null,null,null,null,null,null,null,null,"2024-09-18",95.298425050999995,108.56025529,105.73254274999999,98.268707160999995,null,null,"2024-09-18",0.03]
[null,null,null,null,null,null,null,null,{"$error":"#N/A"},null,null,null,"2024-09-20",93.384178727999995,112.97903328,111.04207287,111.48765545000001,null,null,null,"",null,null,null,null,null,null,null,null,null,null,null,null,null,null,null,"2024-09-19",95.453634211999997,110.02111659000001,106.03066081999999,97.797770864,null,null,"2024-09-19",0.03]
[null,null,null,null,null,null,null,null,{"$error":"#N/A"},null,null,null,"2024-09-23",91.780350728000002,112.55055657,111.08667577,112.85339195,null,null,null,"",null,null,null,null,null,null,null,null,null,null,null,null,null,null,null,"2024-09-20",93.384178727999995,101.62116412,103.64571625000001,92.303514074000006,null,null,"2024-09-20",0.03]
[null,null,null,null,null,null,null,null,{"$error":"#N/A"},null,null,null,"2024-09-24",95.608843374000003,113.91889431,111.13129662,111.33907309,null,null,null,"",null,null,null,null,null,null,null,null,null,null,null,null,null,null,null,"2024-09-23",91.780350728000002,101.16464497,102.95010741,87.908108642000002,null,null,"2024-09-23",0.03]
[null,null,null,null,null,null,null,null,{"$error":"#N/A"},null,null,null,null,null,null,null,null,null,null,null,"",null,null,null,null,null,null,null,null,null,null,null,null,null,null,null,"2024-09-24",95.608843374000003,110.66024341000001,106.52752427,94.658195555999995,null,null,"2024-09-24",0.03]
[null,null,null,null,null,null,null,null,{"$error":"#N/A"},null,null,null,null,null,null,null,null,null,null,null,""]
[null,null,null,null,null,null,null,null,{"$error":"#N/A"},null,null,null,null,null,null,null,null,null,null,null,""]
[null,null,null,null,null,null,null,null,{"$error":"#N/A"},null,null,null,null,null,null,null,null,null,null,null,""]
[null,null,null,null,null,null,null,null,{"$error":"#N/A"},null,null,null,null,null,null,null,null,null,null,null,""]
[null,null,null,null,null,null,null,null,{"$error":"#N/A"},null,null,null,null,null,null,null,null,null,null,null,""]
[null,null,null,null,null,null,null,null,{"$error":"#N/A"},null,null,null,null,null,null,null,null,null,null,null,""]
[null,null,null,null,null,null,null,null,{"$error":"#N/A"},null,null,null,null,null,null,null,null,null,null,null,""]
[null,null,null,null,null,null,null,null,{"$error":"#N/A"},null,null,null,null,null,null,null,null,null,null,null,""]
[null,null,null,null,null,null,null,null,{"$error":"#N/A"},null,null,null,null,null,null,null,null,null,null,null,""]
[null,null,null,null,null,null,null,null,{"$error":"#N/A"},null,null,null,null,null,null,null,null,null,null,null,""]
[null,null,null,null,null,null,null,null,{"$error":"#N/A"},null,null,null,null,null,null,null,null,null,null,null,""]
[null,null,null,null,null,null,null,null,{"$error":"#N/A"},null,null,null,null,null,null,null,null,null,null,null,""]
[null,null,null,null,null,null,null,null,{"$error":"#N/A"},null,null,null,null,null,null,null,null,null,null,null,""]
[null,null,null,null,null,null,null,null,{"$error":"#N/A"},null,null,null,null,null,null,null,null,null,null,null,""]
[null,null,null,null,null,null,null,null,{"$error":"#N/A"},null,null,null,null,null,null,null,null,null,null,null,""]
[null,null,null,null,null,null,null,null,{"$error":"#N/A"},null,null,null,null,null,null,null,null,null,null,null,""]
[null,null,null,null,null,null,null,null,{"$error":"#N/A"},null,null,null,null,null,null,null,null,null,null,null,""]
[null,null,null,null,null,null,null,null,{"$error":"#N/A"},null,null,null,null,null,null,null,null,null,null,null,""]
[null,null,null,null,null,null,null,null,{"$error":"#N/A"},null,null,null,null,null,null,null,null,null,null,null,""]
[null,null,null,null,null,null,null,null,{"$error":"#N/A"},null,null,null,null,null,null,null,null,null,null,null,""]
[null,null,null,null,null,null,null,null,{"$error":"#N/A"},null,null,null,null,null,null,null,null,null,null,null,""]
[null,null,null,null,null,null,null,null,{"$error":"#N/A"},null,null,null,null,null,null,null,null,null,null,null,""]
[null,null,null,null,null,null,null,null,{"$error":"#N/A"},null,null,null,null,null,null,null,null,null,null,null,""]
[null,null,null,null,null,null,null,null,{"$error":"#N/A"},null,null,null,null,null,null,null,null,null,null,null,""]
[null,null,null,null,null,null,null,null,{"$error":"#N/A"},null,null,null,null,null,null,null,null,null,null,null,""]
[null,null,null,null,null,null,null,null,{"$error":"#N/A"},null,null,null,null,null,null,null,null,null,null,null,""]
[null,null,null,null,null,null,null,null,{"$error":"#N/A"},null,null,null,null,null,null,null,null,null,null,null,""]
[null,null,null,null,null,null,null,null,{"$error":"#N/A"},null,null,null,null,null,null,null,null,null,null,null,""]
[null,null,null,null,null,null,null,null,{"$error":"#N/A"},null,null,null,null,null,null,null,null,null,null,null,""]
[null,null,null,null,null,null,null,null,{"$error":"#N/A"},null,null,null,null,null,null,null,null,null,null,null,""]
[null,null,null,null,null,null,null,null,{"$error":"#N/A"},null,null,null,null,null,null,null,null,null,null,null,""]
[null,null,null,null,null,null,null,null,{"$error":"#N/A"},null,null,null,null,null,null,null,null,null,null,null,""]
[null,null,null,null,null,null,null,null,{"$error":"#N/A"},null,null,null,null,null,null,null,null,null,null,null,""]
[null,null,null,null,null,null,null,null,{"$error":"#N/A"},null,null,null,null,null,null,null,null,null,null,null,""]
[null,null,null,null,null,null,null,null,{"$error":"#N/A"},null,null,null,null,null,null,null,null,null,null,null,""]
[null,null,null,null,null,null,null,null,{"$error":"#N/A"},null,null,null,null,null,null,null,null,null,null,null,""]
[null,null,null,null,null,null,null,null,{"$error":"#N/A"},null,null,null,null,null,null,null,null,null,null,null,""]
[null,null,null,null,null,null,null,null,{"$error":"#N/A"},null,null,null,null,null,null,null,null,null,null,null,""]
[null,null,null,null,null,null,null,null,{"$error":"#N/A"},null,null,null,null,null,null,null,null,null,null,null,""]
[null,null,null,null,null,null,null,null,{"$error":"#N/A"},null,null,null,null,null,null,null,null,null,null,null,""]
[null,null,null,null,null,null,null,null,{"$error":"#N/A"},null,null,null,null,null,null,null,null,null,null,null,""]
[null,null,null,null,null,null,null,null,{"$error":"#N/A"},null,null,null,null,null,null,null,null,null,null,null,""]
[null,null,null,null,null,null,null,null,{"$error":"#N/A"},null,null,null,null,null,null,null,null,null,null,null,""]
[null,null,null,null,null,null,null,null,{"$error":"#N/A"},null,null,null,null,null,null,null,null,null,null,null,""]
[null,null,null,null,null,null,null,null,{"$error":"#N/A"},null,null,null,null,null,null,null,null,null,null,null,""]
[null,null,null,null,null,null,null,null,{"$error":"#N/A"},null,null,null,null,null,null,null,null,null,null,null,""]
[null,null,null,null,null,null,null,null,{"$error":"#N/A"},null,null,null,null,null,null,null,null,null,null,null,""]
[null,null,null,null,null,null,null,null,{"$error":"#N/A"},null,null,null,null,null,null,null,null,null,null,null,""]
[null,null,null,null,null,null,null,null,{"$error":"#N/A"},null,null,null,null,null,null,null,null,null,null,null,""]
[null,null,null,null,null,null,null,null,{"$error":"#N/A"},null,null,null,null,null,null,null,null,null,null,null,""]
[null,null,null,null,null,null,null,null,{"$error":"#N/A"},null,null,null,null,null,null,null,null,null,null,null,""]
[null,null,null,null,null,null,null,null,{"$error":"#N/A"},null,null,null,null,null,null,null,null,null,null,null,""]
[null,null,null,null,null,null,null,null,{"$error":"#N/A"},null,null,null,null,null,null,null,null,null,null,null,""]
[null,null,null,null,null,null,null,null,{"$error":"#N/A"},null,null,null,null,null,null,null,null,null,null,null,""]
[null,null,null,null,null,null,null,null,{"$error":"#N/A"},null,null,null,null,null,null,null,null,null,null,null,""]
[null,null,null,null,null,null,null,null,{"$error":"#N/A"},null,null,null,null,null,null,null,null,null,null,null,""]
[null,null,null,null,null,null,null,null,{"$f":"IFERROR(VLOOKUP(F331,$J$11:$K$607,2,0),NA())","v":{"$error":"#N/A"}},null,null,null,null,null,null,null,null,null,null,null,""]
[null,null,null,null,null,null,null,null,{"$error":"#N/A"},null,null,null,null,null,null,null,null,null,null,null,{"$f":"IF(S332=\"\",\"\",IF(T332=\"\",NA(),T332-V332))","v":""}]
[null,null,null,null,null,null,null,null,{"$error":"#N/A"},null,null,null,null,null,null,null,null,null,null,null,""]
[null,null,null,null,null,null,null,null,{"$error":"#N/A"},null,null,null,null,null,null,null,null,null,null,null,""]
[null,null,null,null,null,null,null,null,{"$error":"#N/A"},null,null,null,null,null,null,null,null,null,null,null,""]
[null,null,null,null,null,null,null,null,{"$error":"#N/A"},null,null,null,null,null,null,null,null,null,null,null,""]
[null,null,null,null,null,null,null,null,{"$error":"#N/A"},null,null,null,null,null,null,null,null,null,null,null,""]
[null,null,null,null,null,null,null,null,{"$error":"#N/A"},null,null,null,null,null,null,null,null,null,null,null,""]
[null,null,null,null,null,null,null,null,{"$error":"#N/A"},null,null,null,null,null,null,null,null,null,null,null,""]
[null,null,null,null,null,null,null,null,{"$error":"#N/A"},null,null,null,null,null,null,null,null,null,null,null,""]
[null,null,null,null,null,null,null,null,{"$error":"#N/A"},null,null,null,null,null,null,null,null,null,null,null,""]
[null,null,null,null,null,null,null,null,{"$error":"#N/A"},null,null,null,null,null,null,null,null,null,null,null,""]
[null,null,null,null,null,null,null,null,{"$error":"#N/A"},null,null,null,null,null,null,null,null,null,null,null,""]
[null,null,null,null,null,null,null,null,{"$error":"#N/A"},null,null,null,null,null,null,null,null,null,null,null,""]
[null,null,null,null,null,null,null,null,{"$error":"#N/A"},null,null,null,null,null,null,null,null,null,null,null,""]
[null,null,null,null,null,null,null,null,{"$error":"#N/A"},null,null,null,null,null,null,null,null,null,null,null,""]
[null,null,null,null,null,null,null,null,{"$error":"#N/A"},null,null,null,null,null,null,null,null,null,null,null,""]
[null,null,null,null,null,null,null,null,{"$error":"#N/A"},null,null,null,null,null,null,null,null,null,null,null,""]
[null,null,null,null,null,null,null,null,{"$error":"#N/A"},null,null,null,null,null,null,null,null,null,null,null,""]
[null,null,null,null,null,null,null,null,{"$error":"#N/A"},null,null,null,null,null,null,null,null,null,null,null,""]
[null,null,null,null,null,null,null,null,{"$error":"#N/A"},null,null,null,null,null,null,null,null,null,null,null,""]
[null,null,null,null,null,null,null,null,{"$error":"#N/A"},null,null,null,null,null,null,null,null,null,null,null,""]
[null,null,null,null,null,null,null,null,{"$error":"#N/A"},null,null,null,null,null,null,null,null,null,null,null,""]
[null,null,null,null,null,null,null,null,{"$error":"#N/A"},null,null,null,null,null,null,null,null,null,null,null,""]
[null,null,null,null,null,null,null,null,{"$error":"#N/A"},null,null,null,null,null,null,null,null,null,null,null,""]
[null,null,null,null,null,null,null,null,{"$error":"#N/A"},null,null,null,null,null,null,null,null,null,null,null,""]
[null,null,null,null,null,null,null,null,{"$error":"#N/A"},null,null,null,null,null,null,null,null,null,null,null,""]
[null,null,null,null,null,null,null,null,{"$error":"#N/A"},null,null,null,null,null,null,null,null,null,null,null,""]
[null,null,null,null,null,null,null,null,{"$error":"#N/A"},null,null,null,null,null,null,null,null,null,null,null,""]
[null,null,null,null,null,null,null,null,{"$error":"#N/A"},null,null,null,null,null,null,null,null,null,null,null,""]
[null,null,null,null,null,null,null,null,{"$error":"#N/A"},null,null,null,null,null,null,null,null,null,null,null,""]
[null,null,null,null,null,null,null,null,{"$error":"#N/A"},null,null,null,null,null,null,null,null,null,null,null,""]
[null,null,null,null,null,null,null,null,{"$error":"#N/A"},null,null,null,null,null,null,null,null,null,null,null,""]
[null,null,null,null,null,null,null,null,{"$error":"#N/A"},null,null,null,null,null,null,null,null,null,null,null,""]
[null,null,null,null,null,null,null,null,{"$error":"#N/A"},null,null,null,null,null,null,null,null,null,null,null,""]
[null,null,null,null,null,null,null,null,{"$error":"#N/A"},null,null,null,null,null,null,null,null,null,null,null,""]
[null,null,null,null,null,null,null,null,{"$error":"#N/A"},null,null,null,null,null,null,null,null,null,null,null,""]
[null,null,null,null,null,null,null,null,{"$error":"#N/A"},null,null,null,null,null,null,null,null,null,null,null,""]
[null,null,null,null,null,null,null,null,{"$error":"#N/A"},null,null,null,null,null,null,null,null,null,null,null,""]
[null,null,null,null,null,null,null,null,{"$error":"#N/A"},null,null,null,null,null,null,null,null,null,null,null,""]
[null,null,null,null,null,null,null,null,{"$error":"#N/A"},null,null,null,null,null,null,null,null,null,null,null,""]
[null,null,null,null,null,null,null,null,{"$error":"#N/A"},null,null,null,null,null,null,null,null,null,null,null,""]
[null,null,null,null,null,null,null,null,{"$error":"#N/A"},null,null,null,null,null,null,null,null,null,null,null,""]
[null,null,null,null,null,null,null,null,{"$error":"#N/A"},null,null,null,null,null,null,null,null,null,null,null,""]
[null,null,null,null,null,null,null,null,{"$error":"#N/A"},null,null,null,null,null,null,null,null,null,null,null,""]
[null,null,null,null,null,null,null,null,{"$error":"#N/A"},null,null,null,null,null,null,null,null,null,null,null,""]
[null,null,null,null,null,null,null,null,{"$error":"#N/A"},null,null,null,null,null,null,null,null,null,null,null,""]
[null,null,null,null,null,null,null,null,{"$error":"#N/A"},null,null,null,null,null,null,null,null,null,null,null,""]
[null,null,null,null,null,null,null,null,{"$error":"#N/A"},null,null,null,null,null,null,null,null,null,null,null,""]
[null,null,null,null,null,null,null,null,{"$error":"#N/A"},null,null,null,null,null,null,null,null,null,null,null,""]
[null,null,null,null,null,null,null,null,{"$error":"#N/A"},null,null,null,null,null,null,null,null,null,null,null,""]
[null,null,null,null,null,null,null,null,{"$error":"#N/A"},null,null,null,null,null,null,null,null,null,null,null,""]
[null,null,null,null,null,null,null,null,{"$error":"#N/A"},null,null,null,null,null,null,null,null,null,null,null,""]
[null,null,null,null,null,null,null,null,{"$error":"#N/A"},null,null,null,null,null,null,null,null,null,null,null,""]
[null,null,null,null,null,null,null,null,{"$error":"#N/A"},null,null,null,null,null,null,null,null,null,null,null,""]
[null,null,null,null,null,null,null,null,{"$error":"#N/A"},null,null,null,null,null,null,null,null,null,null,null,""]
[null,null,null,null,null,null,null,null,{"$error":"#N/A"},null,null,null,null,null,null,null,null,null,null,null,""]
[null,null,null,null,null,null,null,null,{"$error":"#N/A"},null,null,null,null,null,null,null,null,null,null,null,""]
[null,null,null,null,null,null,null,null,{"$error":"#N/A"},null,null,null,null,null,null,null,null,null,null,null,""]
[null,null,null,null,null,null,null,null,{"$error":"#N/A"},null,null,null,null,null,null,null,null,null,null,null,""]
[null,null,null,null,null,null,null,null,{"$error":"#N/A"},null,null,null,null,null,null,null,null,null,null,null,""]
[null,null,null,null,null,null,null,null,{"$error":"#N/A"},null,null,null,null,null,null,null,null,null,null,null,""]
[null,null,null,null,null,null,null,null,{"$error":"#N/A"},null,null,null,null,null,null,null,null,null,null,null,""]
[null,null,null,null,null,null,null,null,{"$error":"#N/A"},null,null,null,null,null,null,null,null,null,null,null,""]
[null,null,null,null,null,null,null,null,{"$f":"IFERROR(VLOOKUP(F395,$J$11:$K$607,2,0),NA())","v":{"$error":"#N/A"}},null,null,null,null,null,null,null,null,null,null,null,""]
[null,null,null,null,null,null,null,null,{"$error":"#N/A"},null,null,null,null,null,null,null,null,null,null,null,{"$f":"IF(S396=\"\",\"\",IF(T396=\"\",NA(),T396-V396))","v":""}]
[null,null,null,null,null,null,null,null,{"$error":"#N/A"},null,null,null,null,null,null,null,null,null,null,null,""]
[null,null,null,null,null,null,null,null,{"$error":"#N/A"},null,null,null,null,null,null,null,null,null,null,null,""]
[null,null,null,null,null,null,null,null,{"$error":"#N/A"},null,null,null,null,null,null,null,null,null,null,null,""]
[null,null,null,null,null,null,null,null,{"$error":"#N/A"},null,null,null,null,null,null,null,null,null,null,null,""]
[null,null,null,null,null,null,null,null,{"$error":"#N/A"},null,null,null,null,null,null,null,null,null,null,null,""]
[null,null,null,null,null,null,null,null,{"$error":"#N/A"},null,null,null,null,null,null,null,null,null,null,null,""]
[null,null,null,null,null,null,null,null,{"$error":"#N/A"},null,null,null,null,null,null,null,null,null,null,null,""]
[null,null,null,null,null,null,null,null,{"$error":"#N/A"},null,null,null,null,null,null,null,null,null,null,null,""]
[null,null,null,null,null,null,null,null,{"$error":"#N/A"},null,null,null,null,null,null,null,null,null,null,null,""]
[null,null,null,null,null,null,null,null,{"$error":"#N/A"},null,null,null,null,null,null,null,null,null,null,null,""]
[null,null,null,null,null,null,null,null,{"$error":"#N/A"},null,null,null,null,null,null,null,null,null,null,null,""]
[null,null,null,null,null,null,null,null,{"$error":"#N/A"},null,null,null,null,null,null,null,null,null,null,null,""]
[null,null,null,null,null,null,null,null,{"$error":"#N/A"},null,null,null,null,null,null,null,null,null,null,null,""]
[null,null,null,null,null,null,null,null,{"$error":"#N/A"},null,null,null,null,null,null,null,null,null,null,null,""]
[null,null,null,null,null,null,null,null,{"$error":"#N/A"},null,null,null,null,null,null,null,null,null,null,null,""]
[null,null,null,null,null,null,null,null,{"$error":"#N/A"},null,null,null,null,null,null,null,null,null,null,null,""]
[null,null,null,null,null,null,null,null,{"$error":"#N/A"},null,null,null,null,null,null,null,null,null,null,null,""]
[null,null,null,null,null,null,null,null,{"$error":"#N/A"},null,null,null,null,null,null,null,null,null,null,null,""]
[null,null,null,null,null,null,null,null,{"$error":"#N/A"},null,null,null,null,null,null,null,null,null,null,null,""]
[null,null,null,null,null,null,null,null,{"$error":"#N/A"},null,null,null,null,null,null,null,null,null,null,null,""]
[null,null,null,null,null,null,null,null,{"$error":"#N/A"},null,null,null,null,null,null,null,null,null,null,null,""]
[null,null,null,null,null,null,null,null,{"$error":"#N/A"},null,null,null,null,null,null,null,null,null,null,null,""]
[null,null,null,null,null,null,null,null,{"$error":"#N/A"},null,null,null,null,null,null,null,null,null,null,null,""]
[null,null,null,null,null,null,null,null,{"$error":"#N/A"},null,null,null,null,null,null,null,null,null,null,null,""]
[null,null,null,null,null,null,null,null,{"$error":"#N/A"},null,null,null,null,null,null,null,null,null,null,null,""]
[null,null,null,null,null,null,null,null,{"$error":"#N/A"},null,null,null,null,null,null,null,null,null,null,null,""]
[null,null,null,null,null,null,null,null,{"$error":"#N/A"},null,null,null,null,null,null,null,null,null,null,null,""]
[null,null,null,null,null,null,null,null,{"$error":"#N/A"},null,null,null,null,null,null,null,null,null,null,null,""]
[null,null,null,null,null,null,null,null,{"$error":"#N/A"},null,null,null,null,null,null,null,null,null,null,null,""]
[null,null,null,null,null,null,null,null,{"$error":"#N/A"},null,null,null,null,null,null,null,null,null,null,null,""]
[null,null,null,null,null,null,null,null,{"$error":"#N/A"},null,null,null,null,null,null,null,null,null,null,null,""]
[null,null,null,null,null,null,null,null,{"$error":"#N/A"},null,null,null,null,null,null,null,null,null,null,null,""]
[null,null,null,null,null,null,null,null,{"$error":"#N/A"},null,null,null,null,null,null,null,null,null,null,null,""]
[null,null,null,null,null,null,null,null,{"$error":"#N/A"},null,null,null,null,null,null,null,null,null,null,null,""]
[null,null,null,null,null,null,null,null,{"$error":"#N/A"},null,null,null,null,null,null,null,null,null,null,null,""]
[null,null,null,null,null,null,null,null,{"$error":"#N/A"},null,null,null,null,null,null,null,null,null,null,null,""]
[null,null,null,null,null,null,null,null,{"$error":"#N/A"},null,null,null,null,null,null,null,null,null,null,null,""]
[null,null,null,null,null,null,null,null,{"$error":"#N/A"},null,null,null,null,null,null,null,null,null,null,null,""]
[null,null,null,null,null,null,null,null,{"$error":"#N/A"},null,null,null,null,null,null,null,null,null,null,null,""]
[null,null,null,null,null,null,null,null,{"$error":"#N/A"},null,null,null,null,null,null,null,null,null,null,null,""]
[null,null,null,null,null,null,null,null,{"$error":"#N/A"},null,null,null,null,null,null,null,null,null,null,null,""]
[null,null,null,null,null,null,null,null,{"$error":"#N/A"},null,null,null,null,null,null,null,null,null,null,null,""]
[null,null,null,null,null,null,null,null,{"$error":"#N/A"},null,null,null,null,null,null,null,null,null,null,null,""]
[null,null,null,null,null,null,null,null,{"$error":"#N/A"},null,null,null,null,null,null,null,null,null,null,null,""]
[null,null,null,null,null,null,null,null,{"$error":"#N/A"},null,null,null,null,null,null,null,null,null,null,null,""]
[null,null,null,null,null,null,null,null,{"$error":"#N/A"},null,null,null,null,null,null,null,null,null,null,null,""]
[null,null,null,null,null,null,null,null,{"$error":"#N/A"},null,null,null,null,null,null,null,null,null,null,null,""]
[null,null,null,null,null,null,null,null,{"$error":"#N/A"},null,null,null,null,null,null,null,null,null,null,null,""]
[null,null,null,null,null,null,null,null,{"$error":"#N/A"},null,null,null,null,null,null,null,null,null,null,null,""]
[null,null,null,null,null,null,null,null,{"$error":"#N/A"},null,null,null,null,null,null,null,null,null,null,null,""]
[null,null,null,null,null,null,null,null,{"$error":"#N/A"},null,null,null,null,null,null,null,null,null,null,null,""]
[null,null,null,null,null,null,null,null,{"$error":"#N/A"},null,null,null,null,null,null,null,null,null,null,null,""]
[null,null,null,null,null,null,null,null,{"$error":"#N/A"},null,null,null,null,null,null,null,null,null,null,null,""]
[null,null,null,null,null,null,null,null,{"$error":"#N/A"},null,null,null,null,null,null,null,null,null,null,null,""]
[null,null,null,null,null,null,null,null,{"$error":"#N/A"},null,null,null,null,null,null,null,null,null,null,null,""]
[null,null,null,null,null,null,null,null,{"$error":"#N/A"},null,null,null,null,null,null,null,null,null,null,null,""]
[null,null,null,null,null,null,null,null,{"$error":"#N/A"},null,null,null,null,null,null,null,null,null,null,null,""]
[null,null,null,null,null,null,null,null,{"$error":"#N/A"},null,null,null,null,null,null,null,null,null,null,null,""]
[null,null,null,null,null,null,null,null,{"$error":"#N/A"},null,null,null,null,null,null,null,null,null,null,null,""]
[null,null,null,null,null,null,null,null,{"$error":"#N/A"},null,null,null,null,null,null,null,null,null,null,null,""]
[null,null,null,null,null,null,null,null,{"$error":"#N/A"},null,null,null,null,null,null,null,null,null,null,null,""]
[null,null,null,null,null,null,null,null,{"$error":"#N/A"},null,null,null,null,null,null,null,null,null,null,null,""]
[null,null,null,null,null,null,null,null,{"$f":"IFERROR(VLOOKUP(F459,$J$11:$K$607,2,0),NA())","v":{"$error":"#N/A"}},null,null,null,null,null,null,null,null,null,null,null,""]
[null,null,null,null,null,null,null,null,{"$error":"#N/A"},null,null,null,null,null,null,null,null,null,null,null,{"$f":"IF(S460=\"\",\"\",IF(T460=\"\",NA(),T460-V460))","v":""}]
[null,null,null,null,null,null,null,null,{"$error":"#N/A"},null,null,null,null,null,null,null,null,null,null,null,""]
[null,null,null,null,null,null,null,null,{"$error":"#N/A"},null,null,null,null,null,null,null,null,null,null,null,""]
[null,null,null,null,null,null,null,null,{"$error":"#N/A"},null,null,null,null,null,null,null,null,null,null,null,""]
[null,null,null,null,null,null,null,null,{"$error":"#N/A"},null,null,null,null,null,null,null,null,null,null,null,""]
[null,null,null,null,null,null,null,null,{"$error":"#N/A"},null,null,null,null,null,null,null,null,null,null,null,""]
[null,null,null,null,null,null,null,null,{"$error":"#N/A"},null,null,null,null,null,null,null,null,null,null,null,""]
[null,null,null,null,null,null,null,null,{"$error":"#N/A"},null,null,null,null,null,null,null,null,null,null,null,""]
[null,null,null,null,null,null,null,null,{"$error":"#N/A"},null,null,null,null,null,null,null,null,null,null,null,""]
[null,null,null,null,null,null,null,null,{"$error":"#N/A"},null,null,null,null,null,null,null,null,null,null,null,""]
[null,null,null,null,null,null,null,null,{"$error":"#N/A"},null,null,null,null,null,null,null,null,null,null,null,""]
[null,null,null,null,null,null,null,null,{"$error":"#N/A"},null,null,null,null,null,null,null,null,null,null,null,""]
[null,null,null,null,null,null,null,null,{"$error":"#N/A"},null,null,null,null,null,null,null,null,null,null,null,""]
[null,null,null,null,null,null,null,null,{"$error":"#N/A"},null,null,null,null,null,null,null,null,null,null,null,""]
[null,null,null,null,null,null,null,null,{"$error":"#N/A"},null,null,null,null,null,null,null,null,null,null,null,""]
[null,null,null,null,null,null,null,null,{"$error":"#N/A"},null,null,null,null,null,null,null,null,null,null,null,""]
[null,null,null,null,null,null,null,null,{"$error":"#N/A"},null,null,null,null,null,null,null,null,null,null,null,""]
[null,null,null,null,null,null,null,null,{"$error":"#N/A"},null,null,null,null,null,null,null,null,null,null,null,""]
[null,null,null,null,null,null,null,null,{"$error":"#N/A"},null,null,null,null,null,null,null,null,null,null,null,""]
[null,null,null,null,null,null,null,null,{"$error":"#N/A"},null,null,null,null,null,null,null,null,null,null,null,""]
[null,null,null,null,null,null,null,null,{"$error":"#N/A"},null,null,null,null,null,null,null,null,null,null,null,""]
[null,null,null,null,null,null,null,null,{"$error":"#N/A"},null,null,null,null,null,null,null,null,null,null,null,""]
[null,null,null,null,null,null,null,null,{"$error":"#N/A"},null,null,null,null,null,null,null,null,null,null,null,""]
[null,null,null,null,null,null,null,null,{"$error":"#N/A"},null,null,null,null,null,null,null,null,null,null,null,""]
[null,null,null,null,null,null,null,null,{"$error":"#N/A"},null,null,null,null,null,null,null,null,null,null,null,""]
[null,null,null,null,null,null,null,null,{"$error":"#N/A"},null,null,null,null,null,null,null,null,null,null,null,""]
[null,null,null,null,null,null,null,null,{"$error":"#N/A"},null,null,null,null,null,null,null,null,null,null,null,""]
[null,null,null,null,null,null,null,null,{"$error":"#N/A"},null,null,null,null,null,null,null,null,null,null,null,""]
[null,null,null,null,null,null,null,null,{"$error":"#N/A"},null,null,null,null,null,null,null,null,null,null,null,""]
[null,null,null,null,null,null,null,null,{"$error":"#N/A"},null,null,null,null,null,null,null,null,null,null,null,""]
[null,null,null,null,null,null,null,null,{"$error":"#N/A"},null,null,null,null,null,null,null,null,null,null,null,""]
[null,null,null,null,null,null,null,null,{"$error":"#N/A"},null,null,null,null,null,null,null,null,null,null,null,""]
[null,null,null,null,null,null,null,null,{"$error":"#N/A"},null,null,null,null,null,null,null,null,null,null,null,""]
[null,null,null,null,null,null,null,null,{"$error":"#N/A"},null,null,null,null,null,null,null,null,null,null,null,""]
[null,null,null,null,null,null,null,null,{"$error":"#N/A"},null,null,null,null,null,null,null,null,null,null,null,""]
[null,null,null,null,null,null,null,null,{"$error":"#N/A"},null,null,null,null,null,null,null,null,null,null,null,""]
[null,null,null,null,null,null,null,null,{"$error":"#N/A"},null,null,null,null,null,null,null,null,null,null,null,""]
[null,null,null,null,null,null,null,null,{"$error":"#N/A"},null,null,null,null,null,null,null,null,null,null,null,""]
[null,null,null,null,null,null,null,null,{"$error":"#N/A"},null,null,null,null,null,null,null,null,null,null,null,""]
[null,null,null,null,null,null,null,null,{"$error":"#N/A"},null,null,null,null,null,null,null,null,null,null,null,""]
[null,null,null,null,null,null,null,null,{"$error":"#N/A"},null,null,null,null,null,null,null,null,null,null,null,""]
[null,null,null,null,null,null,null,null,{"$error":"#N/A"},null,null,null,null,null,null,null,null,null,null,null,""]
[null,null,null,null,null,null,null,null,{"$error":"#N/A"},null,null,null,null,null,null,null,null,null,null,null,""]
[null,null,null,null,null,null,null,null,{"$error":"#N/A"},null,null,null,null,null,null,null,null,null,null,null,""]
[null,null,null,null,null,null,null,null,{"$error":"#N/A"},null,null,null,null,null,null,null,null,null,null,null,""]
[null,null,null,null,null,null,null,null,{"$error":"#N/A"},null,null,null,null,null,null,null,null,null,null,null,""]
[null,null,null,null,null,null,null,null,{"$error":"#N/A"},null,null,null,null,null,null,null,null,null,null,null,""]
[null,null,null,null,null,null,null,null,{"$error":"#N/A"},null,null,null,null,null,null,null,null,null,null,null,""]
[null,null,null,null,null,null,null,null,{"$error":"#N/A"},null,null,null,null,null,null,null,null,null,null,null,""]
[null,null,null,null,null,null,null,null,{"$error":"#N/A"},null,null,null,null,null,null,null,null,null,null,null,""]
[null,null,null,null,null,null,null,null,{"$error":"#N/A"},null,null,null,null,null,null,null,null,null,null,null,""]
[null,null,null,null,null,null,null,null,{"$error":"#N/A"},null,null,null,null,null,null,null,null,null,null,null,""]
[null,null,null,null,null,null,null,null,{"$error":"#N/A"},null,null,null,null,null,null,null,null,null,null,null,""]
[null,null,null,null,null,null,null,null,{"$error":"#N/A"},null,null,null,null,null,null,null,null,null,null,null,""]
[null,null,null,null,null,null,null,null,{"$error":"#N/A"},null,null,null,null,null,null,null,null,null,null,null,""]
[null,null,null,null,null,null,null,null,{"$error":"#N/A"},null,null,null,null,null,null,null,null,null,null,null,""]
[null,null,null,null,null,null,null,null,{"$error":"#N/A"},null,null,null,null,null,null,null,null,null,null,null,""]
[null,null,null,null,null,null,null,null,{"$error":"#N/A"},null,null,null,null,null,null,null,null,null,null,null,""]
[null,null,null,null,null,null,null,null,{"$error":"#N/A"},null,null,null,null,null,null,null,null,null,null,null,""]
[null,null,null,null,null,null,null,null,{"$error":"#N/A"},null,null,null,null,null,null,null,null,null,null,null,""]
[null,null,null,null,null,null,null,null,{"$error":"#N/A"},null,null,null,null,null,null,null,null,null,null,null,""]
[null,null,null,null,null,null,null,null,{"$error":"#N/A"},null,null,null,null,null,null,null,null,null,null,null,""]
[null,null,null,null,null,null,null,null,{"$error":"#N/A"},null,null,null,null,null,null,null,null,null,null,null,""]
[null,null,null,null,null,null,null,null,{"$f":"IFERROR(VLOOKUP(F523,$J$11:$K$607,2,0),NA())","v":{"$error":"#N/A"}},null,null,null,null,null,null,null,null,null,null,null,""]
[null,null,null,null,null,null,null,null,{"$error":"#N/A"},null,null,null,null,null,null,null,null,null,null,null,{"$f":"IF(S524=\"\",\"\",IF(T524=\"\",NA(),T524-V524))","v":""}]
[null,null,null,null,null,null,null,null,{"$error":"#N/A"},null,null,null,null,null,null,null,null,null,null,null,""]
[null,null,null,null,null,null,null,null,{"$error":"#N/A"},null,null,null,null,null,null,null,null,null,null,null,""]
[null,null,null,null,null,null,null,null,{"$error":"#N/A"},null,null,null,null,null,null,null,null,null,null,null,""]
[null,null,null,null,null,null,null,null,{"$error":"#N/A"},null,null,null,null,null,null,null,null,null,null,null,""]
[null,null,null,null,null,null,null,null,{"$error":"#N/A"},null,null,null,null,null,null,null,null,null,null,null,""]
[null,null,null,null,null,null,null,null,{"$error":"#N/A"},null,null,null,null,null,null,null,null,null,null,null,""]
[null,null,null,null,null,null,null,null,{"$error":"#N/A"},null,null,null,null,null,null,null,null,null,null,null,""]
[null,null,null,null,null,null,null,null,{"$error":"#N/A"},null,null,null,null,null,null,null,null,null,null,null,""]
[null,null,null,null,null,null,null,null,{"$error":"#N/A"},null,null,null,null,null,null,null,null,null,null,null,""]
[null,null,null,null,null,null,null,null,{"$error":"#N/A"},null,null,null,null,null,null,null,null,null,null,null,""]
[null,null,null,null,null,null,null,null,{"$error":"#N/A"},null,null,null,null,null,null,null,null,null,null,null,""]
[null,null,null,null,null,null,null,null,{"$error":"#N/A"},null,null,null,null,null,null,null,null,null,null,null,""]
[null,null,null,null,null,null,null,null,{"$error":"#N/A"},null,null,null,null,null,null,null,null,null,null,null,""]
[null,null,null,null,null,null,null,null,{"$error":"#N/A"},null,null,null,null,null,null,null,null,null,null,null,""]
[null,null,null,null,null,null,null,null,{"$error":"#N/A"},null,null,null,null,null,null,null,null,null,null,null,""]
[null,null,null,null,null,null,null,null,{"$error":"#N/A"},null,null,null,null,null,null,null,null,null,null,null,""]
[null,null,null,null,null,null,null,null,{"$error":"#N/A"},null,null,null,null,null,null,null,null,null,null,null,""]
[null,null,null,null,null,null,null,null,{"$error":"#N/A"},null,null,null,null,null,null,null,null,null,null,null,""]
[null,null,null,null,null,null,null,null,{"$error":"#N/A"},null,null,null,null,null,null,null,null,null,null,null,""]
[null,null,null,null,null,null,null,null,{"$error":"#N/A"},null,null,null,null,null,null,null,null,null,null,null,""]
[null,null,null,null,null,null,null,null,{"$error":"#N/A"},null,null,null,null,null,null,null,null,null,null,null,""]
[null,null,null,null,null,null,null,null,{"$error":"#N/A"},null,null,null,null,null,null,null,null,null,null,null,""]
[null,null,null,null,null,null,null,null,{"$error":"#N/A"},null,null,null,null,null,null,null,null,null,null,null,""]
[null,null,null,null,null,null,null,null,{"$error":"#N/A"},null,null,null,null,null,null,null,null,null,null,null,""]
[null,null,null,null,null,null,null,null,{"$error":"#N/A"},null,null,null,null,null,null,null,null,null,null,null,""]
[null,null,null,null,null,null,null,null,{"$error":"#N/A"},null,null,null,null,null,null,null,null,null,null,null,""]
[null,null,null,null,null,null,null,null,{"$error":"#N/A"},null,null,null,null,null,null,null,null,null,null,null,""]
[null,null,null,null,null,null,null,null,{"$error":"#N/A"},null,null,null,null,null,null,null,null,null,null,null,""]
[null,null,null,null,null,null,null,null,{"$error":"#N/A"},null,null,null,null,null,null,null,null,null,null,null,""]
[null,null,null,null,null,null,null,null,{"$error":"#N/A"},null,null,null,null,null,null,null,null,null,null,null,""]
[null,null,null,null,null,null,null,null,{"$error":"#N/A"},null,null,null,null,null,null,null,null,null,null,null,""]
[null,null,null,null,null,null,null,null,{"$error":"#N/A"},null,null,null,null,null,null,null,null,null,null,null,""]
[null,null,null,null,null,null,null,null,{"$error":"#N/A"},null,null,null,null,null,null,null,null,null,null,null,""]
[null,null,null,null,null,null,null,null,{"$error":"#N/A"},null,null,null,null,null,null,null,null,null,null,null,""]
[null,null,null,null,null,null,null,null,{"$error":"#N/A"},null,null,null,null,null,null,null,null,null,null,null,""]
[null,null,null,null,null,null,null,null,{"$error":"#N/A"},null,null,null,null,null,null,null,null,null,null,null,""]
[null,null,null,null,null,null,null,null,{"$error":"#N/A"},null,null,null,null,null,null,null,null,null,null,null,""]
[null,null,null,null,null,null,null,null,{"$error":"#N/A"},null,null,null,null,null,null,null,null,null,null,null,""]
[null,null,null,null,null,null,null,null,{"$error":"#N/A"},null,null,null,null,null,null,null,null,null,null,null,""]
[null,null,null,null,null,null,null,null,{"$error":"#N/A"},null,null,null,null,null,null,null,null,null,null,null,""]
[null,null,null,null,null,null,null,null,{"$error":"#N/A"},null,null,null,null,null,null,null,null,null,null,null,""]
[null,null,null,null,null,null,null,null,{"$error":"#N/A"},null,null,null,null,null,null,null,null,null,null,null,""]
[null,null,null,null,null,null,null,null,{"$error":"#N/A"},null,null,null,null,null,null,null,null,null,null,null,""]
[null,null,null,null,null,null,null,null,{"$error":"#N/A"},null,null,null,null,null,null,null,null,null,null,null,""]
[null,null,null,null,null,null,null,null,{"$error":"#N/A"},null,null,null,null,null,null,null,null,null,null,null,""]
[null,null,null,null,null,null,null,null,{"$error":"#N/A"},null,null,null,null,null,null,null,null,null,null,null,""]
[null,null,null,null,null,null,null,null,{"$error":"#N/A"},null,null,null,null,null,null,null,null,null,null,null,""]
[null,null,null,null,null,null,null,null,{"$error":"#N/A"},null,null,null,null,null,null,null,null,null,null,null,""]
[null,null,null,null,null,null,null,null,{"$error":"#N/A"},null,null,null,null,null,null,null,null,null,null,null,""]
[null,null,null,null,null,null,null,null,{"$error":"#N/A"},null,null,null,null,null,null,null,null,null,null,null,""]
[null,null,null,null,null,null,null,null,{"$error":"#N/A"},null,null,null,null,null,null,null,null,null,null,null,""]
[null,null,null,null,null,null,null,null,{"$error":"#N/A"},null,null,null,null,null,null,null,null,null,null,null,""]
[null,null,null,null,null,null,null,null,{"$error":"#N/A"},null,null,null,null,null,null,null,null,null,null,null,""]
[null,null,null,null,null,null,null,null,{"$error":"#N/A"},null,null,null,null,null,null,null,null,null,null,null,""]
[null,null,null,null,null,null,null,null,{"$error":"#N/A"},null,null,null,null,null,null,null,null,null,null,null,""]
[null,null,null,null,null,null,null,null,{"$error":"#N/A"},null,null,null,null,null,null,null,null,null,null,null,""]
[null,null,null,null,null,null,null,null,{"$error":"#N/A"},null,null,null,null,null,null,null,null,null,null,null,""]
[null,null,null,null,null,null,null,null,{"$error":"#N/A"},null,null,null,null,null,null,null,null,null,null,null,""]
[null,null,null,null,null,null,null,null,{"$error":"#N/A"},null,null,null,null,null,null,null,null,null,null,null,""]
[null,null,null,null,null,null,null,null,{"$error":"#N/A"},null,null,null,null,null,null,null,null,null,null,null,""]
[null,null,null,null,null,null,null,null,{"$error":"#N/A"},null,null,null,null,null,null,null,null,null,null,null,""]
[null,null,null,null,null,null,null,null,{"$error":"#N/A"},null,null,null,null,null,null,null,null,null,null,null,""]
[null,null,null,null,null,null,null,null,{"$f":"IFERROR(VLOOKUP(F587,$J$11:$K$607,2,0),NA())","v":{"$error":"#N/A"}},null,null,null,null,null,null,null,null,null,null,null,""]
[null,null,null,null,null,null,null,null,{"$error":"#N/A"},null,null,null,null,null,null,null,null,null,null,null,{"$f":"IF(S588=\"\",\"\",IF(T588=\"\",NA(),T588-V588))","v":""}]
[null,null,null,null,null,null,null,null,{"$error":"#N/A"},null,null,null,null,null,null,null,null,null,null,null,""]
[null,null,null,null,null,null,null,null,{"$error":"#N/A"},null,null,null,null,null,null,null,null,null,null,null,""]
[null,null,null,null,null,null,null,null,{"$error":"#N/A"},null,null,null,null,null,null,null,null,null,null,null,""]
[null,null,null,null,null,null,null,null,{"$error":"#N/A"},null,null,null,null,null,null,null,null,null,null,null,""]
[null,null,null,null,null,null,null,null,{"$error":"#N/A"},null,null,null,null,null,null,null,null,null,null,null,""]
[null,null,null,null,null,null,null,null,{"$error":"#N/A"},null,null,null,null,null,null,null,null,null,null,null,""]
[null,null,null,null,null,null,null,null,{"$error":"#N/A"},null,null,null,null,null,null,null,null,null,null,null,""]
[null,null,null,null,null,null,null,null,{"$error":"#N/A"},null,null,null,null,null,null,null,null,null,null,null,""]
[null,null,null,null,null,null,null,null,{"$error":"#N/A"},null,null,null,null,null,null,null,null,null,null,null,""]
[null,null,null,null,null,null,null,null,{"$error":"#N/A"},null,null,null,null,null,null,null,null,null,null,null,""]
[null,null,null,null,null,null,null,null,{"$error":"#N/A"},null,null,null,null,null,null,null,null,null,null,null,""]
[null,null,null,null,null,null,null,null,{"$error":"#N/A"},null,null,null,null,null,null,null,null,null,null,null,""]
[null,null,null,null,null,null,null,null,{"$error":"#N/A"},null,null,null,null,null,null,null,null,null,null,null,""]
[null,null,null,null,null,null,null,null,{"$error":"#N/A"},null,null,null,null,null,null,null,null,null,null,null,""]
[null,null,null,null,null,null,null,null,{"$error":"#N/A"},null,null,null,null,null,null,null,null,null,null,null,""]
[null,null,null,null,null,null,null,null,{"$error":"#N/A"},null,null,null,null,null,null,null,null,null,null,null,""]
[null,null,null,null,null,null,null,null,{"$error":"#N/A"},null,null,null,null,null,null,null,null,null,null,null,""]
[null,null,null,null,null,null,null,null,{"$error":"#N/A"},null,null,null,null,null,null,null,null,null,null,null,""]
[null,null,null,null,null,null,null,null,{"$error":"#N/A"},null,null,null,null,null,null,null,null,null,null,null,""]

{"sheet":"Base Ibov","index":2,"n_rows":97,"n_cols":21,"rows_kept":97,"cut":false,"hidden":false,"merged":[[2,11,2,13]]}
[null,null,null,null,null,"Planilha Auxiliar Não Modificar"]
[null,null,null,null,null,null,{"$f":"'Lâmina De RI'!$C$5","v":"2024-09-24"}]
[null,{"$f":"_xll.ECODATASET(\"ibov\",\"ph\",\"LATEST\",\"1D\")","v":{"$error":"#VALUE!"}},"Descrição","Classe","2024-09-30",{"$f":"_xll.ECONOMATICA($B$4:$B$150,\"Segment Bovespa\",,,,,,,,\"TRUE\",\"SETOR\")","v":{"$error":"#VALUE!"}},{"$f":"_xll.ECONOMATICA($B$4:$B$150,\"return\",\"1D\",$G$2,,,,\"DECIMAL\",,\"TRUE\",\"RETORNO\")","v":{"$error":"#VALUE!"}},null,"Setor","Setor Setor",null,"Ranking",null,null,null,"PEERS"]
[null,"VALE3<XBSP>","Vale","ON",11.412000000000001,"Minerais metálicos",4.8844081349999999E-2,null,{"$f":"IF(_xlfn.UNIQUE($F$4:$F$150)=0,\"\",_xlfn.UNIQUE($F$4:$F$150))","v":"Minerais metálicos"},{"$f":"IF(I4=\"\",\"\",AVERAGEIF($F:$F,I4,$G:$G))","v":4.4378320384000004E-2},null,"Maior",{"$f":"LARGE($J:$J,1)","v":6.1777801601999999E-2},{"$f":"_xlfn.XLOOKUP($M$4,$J:$J,$I:$I,,0)","v":"Siderurgia"},null,{"$f":"_xll.ECONOMATICA('Lâmina De RI'!$C$3,\"Segment Bovespa\")","v":{"$error":"#VALUE!"}}]
[null,"PETR4<XBSP>","Petrobras","PN",7.5389999999999997,"Exploração refino e distribuição",4.0950040947999996E-3,null,"Exploração refino e distribuição",{"$f":"IF(I5=\"\",\"\",AVERAGEIF($F:$F,I5,$G:$G))","v":2.9838504598999997E-2},null,"Menor",{"$f":"SMALL($J:$J,1)","v":-5.0373134329000001E-2},{"$f":"_xlfn.XLOOKUP($M$5,$J:$J,$I:$I,,0)","v":"Transporte aéreo"}]
[null,"ITUB4<XBSP>","ItauUnibanco","PN",7.391,"Bancos",-2.7995520577000002E-4,null,"Bancos",-4.7587163109428582E-4]
[null,"PETR3<XBSP>","Petrobras","ON",4.5709999999999997,"Exploração refino e distribuição",7.4626865661999997E-3,null,"Energia elétrica",-5.742823179916666E-4,null,{"$f":"AVERAGE($M$10:$M$17)","v":{"$error":"#DIV/0!"}},null,"Imóveis",null,{"$f":"_xll.ECONOMATICA($Q$7:$Q$50,\"MarketCapitaliz\",,\"LATEST\",,,,,,\"FALSE\")","v":{"$error":"#VALUE!"}},{"$f":"_xll.ECOSECURITIES(\"STOCK\",\"ACTIVE\",\"TRUE\",\"BRA\",\"XBSP\",\"FALSE\",,\"Segment Bovespa=\"&$P$4)","v":{"$error":"#VALUE!"}},1,{"$f":"IFERROR(LARGE($P:$P,R7),\"\")","v":""},{"$f":"VLOOKUP($S7,$P:$Q,2,0)","v":{"$error":"#N/A"}},{"$f":"_xll.ECONOMATICA($T$7:$T$11,\"TICKER\",,,,,,,,\"FALSE\")","v":{"$error":"#VALUE!"}}]
[null,"BBAS3<XBSP>","Brasil","ON",3.6179999999999999,"Bancos",-7.2992700734000003E-4,null,"Motores compressores e outros",1.9698085420000001E-2,null,null,null,null,null,37527900566,"GGBR4<XBSP>",2,{"$f":"IFERROR(LARGE($P:$P,R8),\"\")","v":""},{"$f":"VLOOKUP($S8,$P:$Q,2,0)","v":{"$error":"#N/A"}},"CSNA3"]
[null,"BBDC4<XBSP>","Bradesco","PN",3.4239999999999999,"Bancos",-1.3917884471E-3,null,"Água e saneamento",-9.7201452681E-3,null,null,{"$f":"_xll.ECONOMATICA($L$10:$L$17,\"return\",\"1D\",$G$2,,,,\"DECIMAL\",,\"TRUE\",\"RETORNO\")","v":{"$error":"#VALUE!"}},null,null,11114419563,"GOAU4<XBSP>",3,"",{"$error":"#N/A"},"GOAU4"]
[null,"ELET3<XBSP>","Eletrobras","ON",3.27,"Energia elétrica",2.5284450075999999E-3,null,"Serviços financeiros diversos",4.4642857138000001E-3,null,"SCAR3",null,null,null,16072258638,"CSNA3<XBSP>",4,"",{"$error":"#N/A"},"USIM5"]
[null,"WEGE3<XBSP>","Weg","ON",3.202,"Motores compressores e outros",1.9698085420000001E-2,null,"Cervejas e refrigerantes",7.8431372457999997E-4,null,"ALSO3",null,null,null,7317421386.5,"USIM5<XBSP>",5,"",{"$error":"#N/A"},"FESA4"]
[null,"SBSP3<XBSP>","Sabesp","ON",2.9729999999999999,"Água e saneamento",-9.7201452681E-3,null,"Aluguel de carros",2.8163867669000003E-3,null,"IGTI3"]
[null,"B3SA3<XBSP>","B3","ON",2.867,"Serviços financeiros diversos",4.4642857138000001E-3,null,"Serviços médico-hospitalares análises e diagnósticos",5.2486315081200002E-3,null,"MULT3"]
[null,"ITSA4<XBSP>","Itausa","PN",2.7869999999999999,"Bancos",9.1743119265000003E-4,null,"Carnes e derivados",1.6996960020999995E-3,null,"SYNE3"]
[null,"ABEV3<XBSP>","Ambev S/A","ON",2.6030000000000002,"Cervejas e refrigerantes",7.8431372457999997E-4,null,"Material aeronáutico e de defesa",1.4195903467999999E-2]
[null,"BPAC11<XBSP>","Btgp Banco","UNT",1.96,"Bancos",-2.7447392485999999E-3,null,"Medicamentos e outros produtos",-7.3457669836500001E-3]
[null,"RENT3<XBSP>","Localiza","ON",1.9390000000000001,"Aluguel de carros",8.6630765636000005E-3,null,"Papel e celulose",1.8689072330999999E-2]
[null,"EQTL3<XBSP>","Equatorial","ON",1.879,"Energia elétrica",2.4615384626999999E-3,null,"Transporte ferroviário",1.1616161617E-2]
[null,"RDOR3<XBSP>","Rede D Or","ON",1.6910000000000001,"Serviços médico-hospitalares análises e diagnósticos",1.1638880149999999E-2,null,"Seguradoras",6.2123074285499996E-3]
[null,"JBSS3<XBSP>","JBS","ON",1.6879999999999999,"Carnes e derivados",6.6016975797999998E-3,null,"Telecomunicações",8.1290465095500003E-3,null,"SOMA3<XBSP>"]
[null,"EMBR3<XBSP>","Embraer","ON",1.6819999999999999,"Material aeronáutico e de defesa",1.4195903467999999E-2,null,"Siderurgia",6.1777801601999999E-2,null,"GUAR3<XBSP>"]
[null,"PRIO3<XBSP>","Petrorio","ON",1.6539999999999999,"Exploração refino e distribuição",4.3965903990999998E-2,null,"Tecidos vestuário e calçados",2.2506845790149999E-2,null,"LREN3<XBSP>"]
[null,"RADL3<XBSP>","RaiaDrogasil","ON",1.5960000000000001,"Medicamentos e outros produtos",-1.1173184358E-2,null,"Programas e serviços",1.66690198165E-2,null,"ARZZ3<XBSP>"]
[null,"SUZB3<XBSP>","Suzano S.A.","ON",1.5129999999999999,"Papel e celulose",2.6331074539E-2,null,"Serviços de apoio e armazenagem",4.0540540540000003E-3,null,"AMAR3<XBSP>"]
[null,"VBBR3<XBSP>","Vibra","ON",1.121,"Exploração refino e distribuição",2.7818708946000002E-2,null,"Exploração de rodovias",-7.2815533977000002E-3]
[null,"RAIL3<XBSP>","Rumo S.A.","ON",1.1180000000000001,"Transporte ferroviário",1.1616161617E-2,null,"Produtos de uso pessoal",-7.3313782995999997E-3]
[null,"UGPA3<XBSP>","Ultrapar","ON",1.069,"Exploração refino e distribuição",1.8948365705000001E-2,null,"Exploração de imóveis",5.933421488700001E-3]
[null,"BBSE3<XBSP>","BBSeguridade","ON",1.04,"Seguradoras",8.2550526603999991E-3,null,"Alimentos",2.2319088221666662E-2]
[null,"VIVT3<XBSP>","Telef Brasil","ON",1.0389999999999999,"Telecomunicações",6.3717458597000003E-3,null,"Incorporações",1.05169101854E-2]
[null,"GGBR4<XBSP>","Gerdau","PN",1.024,"Siderurgia",4.1713641489000003E-2,null,"Petroquímicos",2.5066666667000002E-2]
[null,"ENEV3<XBSP>","Eneva","ON",1.016,"Energia elétrica",1.2274368230999999E-2,null,"Açúcar e álcool",9.2971364810999994E-3]
[null,"CMIG4<XBSP>","Cemig","PN",0.98299999999999998,"Energia elétrica",-3.0618916325999999E-3,null,"Resseguradoras",1.2535737849E-2]
[null,"BRFS3<XBSP>","BRF SA","ON",0.93899999999999995,"Carnes e derivados",-6.0410793393999998E-3,null,"Agricultura",1.63238201135E-2]
[null,"HAPV3<XBSP>","Hapvida","ON",0.93899999999999995,"Serviços médico-hospitalares análises e diagnósticos",4.7281323877999999E-3,null,"Eletrodomésticos",1.6966067864000001E-2]
[null,"BBDC3<XBSP>","Bradesco","ON",0.89100000000000001,"Bancos",-4.6403712294999996E-3,null,"Acessórios",9.5342867626E-3]
[null,"CPLE6<XBSP>","Copel","PNB",0.80600000000000005,"Energia elétrica",-5.8027079303000001E-3,null,"Serviços educacionais",2.2266204849E-2]
[null,"LREN3<XBSP>","Lojas Renner","ON",0.78300000000000003,"Tecidos vestuário e calçados",5.3642010164999997E-2,null,"Transporte aéreo",-5.0373134329000001E-2]
[null,"KLBN11<XBSP>","Klabin S/A","UNT N2",0.74099999999999999,"Papel e celulose",1.1047070123E-2,null,"Produtos diversos",1.2903225806E-2]
[null,"TOTS3<XBSP>","Totvs","ON",0.71799999999999997,"Programas e serviços",1.4335664336E-2,null,"Calçados",2.8050490890999999E-3]
[null,"TIMS3<XBSP>","Tim","ON",0.69899999999999995,"Telecomunicações",9.8863471594000003E-3,null,"Viagens e turismo",-5.3475935829000003E-3]
[null,"ENGI11<XBSP>","Energisa","UNT N2",0.68700000000000006,"Energia elétrica",4.6326935790000001E-3,null,"",""]
[null,"CSAN3<XBSP>","Cosan","ON",0.66300000000000003,"Exploração refino e distribuição",3.8367346938999999E-2,null,null,""]
[null,"STBP3<XBSP>","Santos Brp","ON",0.58799999999999997,"Serviços de apoio e armazenagem",4.0540540540000003E-3,null,null,""]
[null,"CCRO3<XBSP>","CCR SA","ON",0.56899999999999995,"Exploração de rodovias",-7.2815533977000002E-3,null,null,""]
[null,"ELET6<XBSP>","Eletrobras","PNB",0.55200000000000005,"Energia elétrica",-3.3898305090999999E-3,null,null,""]
[null,"NTCO3<XBSP>","Grupo Natura","ON",0.53800000000000003,"Produtos de uso pessoal",-7.3313782995999997E-3,null,null,""]
[null,"ALOS3<XBSP>","Allos","ON",0.51800000000000002,"Exploração de imóveis",3.1559963936000001E-3,null,null,""]
[null,"EGIE3<XBSP>","Engie Brasil","ON",0.51500000000000001,"Energia elétrica",3.2213529665999999E-3,null,null,""]
[null,"HYPE3<XBSP>","Hypera","ON",0.51200000000000001,"Medicamentos e outros produtos",-3.5183496092999998E-3,null,null,""]
[null,"ASAI3<XBSP>","Assai","ON",0.49299999999999999,"Alimentos",3.6895674299000002E-2,null,null,""]
[null,"SANB11<XBSP>","Santander BR","UNT",0.47799999999999998,"Bancos",5.5382485279999996E-3,null,null,""]
[null,"TRPL4<XBSP>","Tran Paulist","PN",0.44800000000000001,"Energia elétrica",-4.1017227249999998E-4,null,null,""]
[null,"BRAV3<XBSP>","Brava","ON",0.38600000000000001,"Exploração refino e distribuição",8.7150837989999994E-2,null,null,""]
[null,"MULT3<XBSP>","Multiplan","ON",0.38600000000000001,"Exploração de imóveis",6.1255742730000002E-3,null,null,""]
[null,"CSNA3<XBSP>","Sid Nacional","ON",0.379,"Siderurgia",9.3862815884E-2,null,null,""]
[null,"TAEE11<XBSP>","Taesa","UNT N2",0.34799999999999998,"Energia elétrica",-4.0816326537000003E-3,null,null,""]
[null,"FLRY3<XBSP>","Fleury","ON",0.34699999999999998,"Serviços médico-hospitalares análises e diagnósticos",-6.2111801344000002E-4,null,null,""]
[null,"CXSE3<XBSP>","Caixa Seguri","ON",0.34599999999999997,"Seguradoras",4.1695621967E-3,null,null,""]
[null,"CMIN3<XBSP>","Csn Mineracao","ON",0.32700000000000001,"Minerais metálicos",4.1074249604000003E-2,null,null,""]
[null,"GOAU4<XBSP>","Gerdau Met","PN",0.318,"Siderurgia",3.4749034748999999E-2,null,null,""]
[null,"CPFE3<XBSP>","CPFL Energia","ON",0.29099999999999998,"Energia elétrica",-2.9994001206000002E-3,null,null,""]
[null,"AZZA3<XBSP>","Azzas 2154","ON",0.26700000000000002,"Tecidos vestuário e calçados",-8.6283185846999996E-3,null,null,""]
[null,"CYRE3<XBSP>","Cyrela Realt","ON",0.248,"Incorporações",1.2877662208999999E-2,null,null,""]
[null,"RECV3<XBSP>","Petrorecsa","ON",0.23499999999999999,"Exploração refino e distribuição",1.089918256E-2,null,null,""]
[null,"BRKM5<XBSP>","Braskem","PNA",0.23100000000000001,"Petroquímicos",2.5066666667000002E-2,null,null,""]
[null,"CRFB3<XBSP>","Carrefour BR","ON",0.215,"Alimentos",4.7126436782E-2,null,null,""]
[null,"BRAP4<XBSP>","Bradespar","PN",0.21299999999999999,"Minerais metálicos",4.3216630197999997E-2,null,null,""]
[null,"IGTI11<XBSP>","Iguatemi SA","UNT",0.20799999999999999,"Exploração de imóveis",8.5186937995E-3,null,null,""]
[null,"MRFG3<XBSP>","Marfrig","ON",0.19700000000000001,"Carnes e derivados",-1.2082444919000001E-2]
[null,"SMTO3<XBSP>","Sao Martinho","ON",0.17799999999999999,"Açúcar e álcool",9.2971364810999994E-3]
[null,"IRBR3<XBSP>","Irbbrasil Re","ON",0.17299999999999999,"Resseguradoras",1.2535737849E-2]
[null,"RAIZ4<XBSP>","Raizen","PN",0.16800000000000001,"Agricultura",1.9736842104999999E-2]
[null,"MGLU3<XBSP>","Magaz Luiza","ON",0.16500000000000001,"Eletrodomésticos",1.6966067864000001E-2]
[null,"VIVA3<XBSP>","Vivara S.A.","ON",0.159,"Acessórios",9.5342867626E-3]
[null,"SLCE3<XBSP>","SLC Agricola","ON",0.154,"Agricultura",1.2910798122E-2]
[null,"VAMO3<XBSP>","Vamos","ON",0.14899999999999999,"Aluguel de carros",-3.0303030298E-3]
[null,"AURE3<XBSP>","Auren","ON",0.14299999999999999,"Energia elétrica",-1.2264150943999999E-2]
[null,"USIM5<XBSP>","Usiminas","PNA",0.13400000000000001,"Siderurgia",7.6785714286000006E-2]
[null,"MRVE3<XBSP>","MRV","ON",0.127,"Incorporações",9.5890410957999994E-3]
[null,"YDUQ3<XBSP>","Yduqs Part","ON",0.126,"Serviços educacionais",2.1276595746E-2]
[null,"COGN3<XBSP>","Cogna ON","ON",0.113,"Serviços educacionais",2.3255813952E-2]
[null,"AZUL4<XBSP>","Azul","PN",8.2000000000000003E-2,"Transporte aéreo",-5.0373134329000001E-2]
[null,"LWSA3<XBSP>","Lwsa","ON",8.2000000000000003E-2,"Programas e serviços",1.9002375296999999E-2]
[null,"BEEF3<XBSP>","Minerva","ON",0.08,"Carnes e derivados",1.8320610687E-2]
[null,"PETZ3<XBSP>","Petz","ON",6.6000000000000003E-2,"Produtos diversos",1.2903225806E-2]
[null,"EZTC3<XBSP>","Eztec","ON",0.06,"Incorporações",9.0840272513999995E-3]
[null,"ALPA4<XBSP>","Alpargatas","PN",5.5E-2,"Calçados",2.8050490890999999E-3]
[null,"PCAR3<XBSP>","P.Acucar-Cbd","ON",5.1999999999999998E-2,"Alimentos",-1.7064846416E-2]
[null,"CVCB3<XBSP>","Cvc Brasil","ON",4.5999999999999999E-2,"Viagens e turismo",-5.3475935829000003E-3]
[null,null,"Total",null,100]
[]
[null,null,"Total Investido + Caixa (em milhares)",null,{"$f":"#NUM!","v":{"$error":"#NUM!"}}]
[null,null,"PL (em milhares)",null,{"$f":"#NUM!","v":{"$error":"#NUM!"}}]
[]
[null,null,"Data de divulgação",null,{"$f":"#NUM!","v":{"$error":"#NUM!"}}]
[null,null,"Data da última retificação",null,45560]
[null,null,"Data informada pela fonte",null,45559]

{"sheet":"Versão","index":3,"n_rows":1,"n_cols":2,"rows_kept":1,"cut":false,"hidden":true,"merged":[]}
["Versão","v220422"]