{"text_format":"1","workbook":"xlsx","n_sheets":3,"sheets":["Lâmina Cart. Hip. Cons. Mod. Ag","Historico","Anual"],"not_rendered":{"charts":2,"images":2,"macros":1,"external_links":0,"defined_names":25,"comments":0,"pivot_tables":0},"unopened":[],"bounds":{"document_bytes":16777216,"sheet_cells":100000,"rows_first":2000,"rows_last":500,"rows_between":2000,"halvings":0,"cell_chars":16384,"cell_head_chars":4096},"cells_cut":0,"cells_raw":0,"read":"whole","date_system":"1900"}

{"sheet":"Lâmina Cart. Hip. Cons. Mod. Ag","index":0,"n_rows":88,"n_cols":31,"rows_kept":88,"cut":false,"hidden":false,"merged":[[2,20,2,30],[22,20,22,30],[43,20,43,30],[84,20,85,20],[86,20,87,20],[70,20,71,20],[72,20,73,20],[74,20,75,20],[76,20,77,20],[78,20,79,20],[3,16,3,17],[3,11,3,13],[52,20,53,20],[54,20,55,20],[82,20,83,20],[56,20,57,20],[58,20,59,20],[60,20,61,20],[4,10,4,13],[4,16,4,18],[80,20,81,20],[68,20,69,20],[46,20,47,20],[48,20,49,20],[50,20,51,20],[62,20,63,20],[64,20,65,20],[66,20,67,20]]}
[null,null,null,null,"Perfil de Alocação - Criação das Carteiras Hipotética Em Percentual"]
[null,null,null,"Dta. Últ. Cot.: ",{"$f":"IF(E3=\"\",_xll.ECONOMATICA(\"IBOV\",\"DATE OF LAST QUOTE\"),E3)","v":"2024-09-24"},null,"← Não Modificar"]
[null,null,null,"Dta. Pref. Últ. Cot.: ",null,null,"← Para alterar a data da Célula E2, basta digitar na Célula E3",null,null,null,null,null,null,null,null,null,null,null,null,null,"Gráfico de Rentabilidade - Base 100"]
[]
[null,null,null,"Total %",{"$f":"SUM(E11:E70)","v":100},null,{"$f":"SUM(G11:G70)","v":100},null,{"$f":"SUM(I11:I70)","v":100},null,"Dispersão de Risco x Retorno",null,null,null,null,"↓ Período ↓","Estatísticas"]
[null,"Lista de Índices",null,"Retorno - 12M",{"$f":"IFERROR(_xll.ECONOMATICA(E8,\"return\",\"12m\",\"latest\",,,,\"decimal\"),\"Verificar (%)\")","v":9.9871880226000007E-2},null,{"$f":"IFERROR(_xll.ECONOMATICA(G8,\"return\",\"12m\",\"latest\",,,,\"decimal\"),\"Verificar (%)\")","v":0.10766719452},null,{"$f":"IFERROR(_xll.ECONOMATICA(I8,\"return\",\"12m\",\"latest\",,,,\"decimal\"),\"Verificar (%)\")","v":0.10151395488999999},null,"Código","Clas. Ações",{"$f":"IFERROR(_xll.ECONOMATICA($K$7:$K$9,\"return\",$P$6,$E$2,,,,\"decimal\",,,\"Retorno\"),\"Retorno\")","v":"Retorno"},{"$f":"IFERROR(_xll.ECONOMATICA($K$7:$K$9,\"volatility\",$P$6,$E$2,,,,\"decimal\",,,\"Volatilidade\"),\"Volatilidade\")","v":"Volatilidade"},null,"48M",{"$f":"$E$8","v":"Conservador                                                                                                     <EcoPortfolio>{\"type\":\"P\",\"tolerance\":null,\"rebalance\":\"NO\",\"name\":\"Conservador\",\"data\":[[null,\"2024-09-24\"],[\"CDI Acumulado\",40.0],[\"IDA DI\",25.0],[\"IRF-M\",15.0],[\"IMA-B\",5.0],[\"IBXX\",0.0],[\"SMLL<xbsp>\",5.0],[\"BDRX\",0.0],[\"IFIX\",5.0],[\"DOLOF\",5.0],[\"ABEV3<XBSP>\",null],[\"BRML3<XBSP>\",null],[\"BBDC4<XBSP>\",null],[\"024813\",null],[\"267163\",null],[\"219436\",null],[\"\",null],[\"\",null],[\"\",null],[\"\",null],[\"\",null],[\"\",null],[\"\",null],[\"\",null],[\"\",null],[\"\",null],[\"\",null],[\"\",null],[\"\",null],[\"\",null],[\"\",null],[\"\",null],[\"\",null],[\"\",null],[\"\",null],[\"\",null],[\"\",null],[\"\",null],[\"\",null],[\"\",null],[\"\",null],[\"\",null],[\"\",null],[\"\",null],[\"\",null],[\"\",null],[\"\",null],[\"\",null],[\"\",null],[\"\",null],[\"\",null],[\"\",null],[\"\",null],[\"\",null],[\"\",null],[\"\",null],[\"\",null],[\"\",null],[\"\",null],[\"\",null],[\"\",null]]}"},{"$f":"$G$8","v":"Moderada                                                                                                     <EcoPortfolio>{\"type\":\"P\",\"tolerance\":null,\"rebalance\":\"NO\",\"name\":\"Moderada\",\"data\":[[null,\"2024-09-24\"],[\"CDI Acumulado\",20.0],[\"IDA DI\",20.0],[\"IRF-M\",20.0],[\"IMA-B\",15.0],[\"IBXX\",5.0],[\"SMLL<xbsp>\",5.0],[\"BDRX\",5.0],[\"IFIX\",5.0],[\"DOLOF\",5.0],[\"ABEV3<XBSP>\",null],[\"BRML3<XBSP>\",null],[\"BBDC4<XBSP>\",null],[\"024813\",null],[\"267163\",null],[\"219436\",null],[\"\",null],[\"\",null],[\"\",null],[\"\",null],[\"\",null],[\"\",null],[\"\",null],[\"\",null],[\"\",null],[\"\",null],[\"\",null],[\"\",null],[\"\",null],[\"\",null],[\"\",null],[\"\",null],[\"\",null],[\"\",null],[\"\",null],[\"\",null],[\"\",null],[\"\",null],[\"\",null],[\"\",null],[\"\",null],[\"\",null],[\"\",null],[\"\",null],[\"\",null],[\"\",null],[\"\",null],[\"\",null],[\"\",null],[\"\",null],[\"\",null],[\"\",null],[\"\",null],[\"\",null],[\"\",null],[\"\",null],[\"\",null],[\"\",null],[\"\",null],[\"\",null]]}"},{"$f":"$I$8","v":"Agressiva                                                                                                     <EcoPortfolio>{\"type\":\"P\",\"tolerance\":null,\"rebalance\":\"NO\",\"name\":\"Agressiva\",\"data\":[[null,\"2024-09-24\"],[\"CDI Acumulado\",5.0],[\"IDA DI\",5.0],[\"IRF-M\",15.0],[\"IMA-B\",10.0],[\"IBXX\",15.0],[\"SMLL<xbsp>\",15.0],[\"BDRX\",10.0],[\"IFIX\",15.0],[\"DOLOF\",10.0],[\"ABEV3<XBSP>\",null],[\"BRML3<XBSP>\",null],[\"BBDC4<XBSP>\",null],[\"024813\",null],[\"267163\",null],[\"219436\",null],[\"\",null],[\"\",null],[\"\",null],[\"\",null],[\"\",null],[\"\",null],[\"\",null],[\"\",null],[\"\",null],[\"\",null],[\"\",null],[\"\",null],[\"\",null],[\"\",null],[\"\",null],[\"\",null],[\"\",null],[\"\",null],[\"\",null],[\"\",null],[\"\",null],[\"\",null],[\"\",null],[\"\",null],[\"\",null],[\"\",null],[\"\",null],[\"\",null],[\"\",null],[\"\",null],[\"\",null],[\"\",null],[\"\",null],[\"\",null],[\"\",null],[\"\",null],[\"\",null],[\"\",null],[\"\",null],[\"\",null],[\"\",null],[\"\",null],[\"\",null],[\"\",null]]}"},"."]
[null,null,null,null,null,null,null,null,null,null,{"$f":"$E$8","v":"Conservador                                                                                                     <EcoPortfolio>{\"type\":\"P\",\"tolerance\":null,\"rebalance\":\"NO\",\"name\":\"Conservador\",\"data\":[[null,\"2024-09-24\"],[\"CDI Acumulado\",40.0],[\"IDA DI\",25.0],[\"IRF-M\",15.0],[\"IMA-B\",5.0],[\"IBXX\",0.0],[\"SMLL<xbsp>\",5.0],[\"BDRX\",0.0],[\"IFIX\",5.0],[\"DOLOF\",5.0],[\"ABEV3<XBSP>\",null],[\"BRML3<XBSP>\",null],[\"BBDC4<XBSP>\",null],[\"024813\",null],[\"267163\",null],[\"219436\",null],[\"\",null],[\"\",null],[\"\",null],[\"\",null],[\"\",null],[\"\",null],[\"\",null],[\"\",null],[\"\",null],[\"\",null],[\"\",null],[\"\",null],[\"\",null],[\"\",null],[\"\",null],[\"\",null],[\"\",null],[\"\",null],[\"\",null],[\"\",null],[\"\",null],[\"\",null],[\"\",null],[\"\",null],[\"\",null],[\"\",null],[\"\",null],[\"\",null],[\"\",null],[\"\",null],[\"\",null],[\"\",null],[\"\",null],[\"\",null],[\"\",null],[\"\",null],[\"\",null],[\"\",null],[\"\",null],[\"\",null],[\"\",null],[\"\",null],[\"\",null],[\"\",null],[\"\",null]]}"},"-",0.34647186716,2.1095853958999999E-2,null,"RETORNO",{"$f":"IFERROR(_xll.ECONOMATICA($Q$6,\"RETURN\",$P$6,$E$2,,,,\"DECIMAL\"),\"-\")","v":0.34647186716},{"$f":"IFERROR(_xll.ECONOMATICA($R$6,\"RETURN\",$P$6,$E$2,,,,\"DECIMAL\"),\"-\")","v":0.33473611323000002},{"$f":"IFERROR(_xll.ECONOMATICA($S$6,\"RETURN\",$P$6,$E$2,,,,\"DECIMAL\"),\"-\")","v":0.21534617781000001}]
[null,"BDRX",null,"Formula →",{"$f":"_xll.ECOPORTFOLIO(\"P\",$D$10:$E$70,,\"NO\",\"Conservador\")","v":"Conservador                                                                                                     <EcoPortfolio>{\"type\":\"P\",\"tolerance\":null,\"rebalance\":\"NO\",\"name\":\"Conservador\",\"data\":[[null,\"2024-09-24\"],[\"CDI Acumulado\",40.0],[\"IDA DI\",25.0],[\"IRF-M\",15.0],[\"IMA-B\",5.0],[\"IBXX\",0.0],[\"SMLL<xbsp>\",5.0],[\"BDRX\",0.0],[\"IFIX\",5.0],[\"DOLOF\",5.0],[\"ABEV3<XBSP>\",null],[\"BRML3<XBSP>\",null],[\"BBDC4<XBSP>\",null],[\"024813\",null],[\"267163\",null],[\"219436\",null],[\"\",null],[\"\",null],[\"\",null],[\"\",null],[\"\",null],[\"\",null],[\"\",null],[\"\",null],[\"\",null],[\"\",null],[\"\",null],[\"\",null],[\"\",null],[\"\",null],[\"\",null],[\"\",null],[\"\",null],[\"\",null],[\"\",null],[\"\",null],[\"\",null],[\"\",null],[\"\",null],[\"\",null],[\"\",null],[\"\",null],[\"\",null],[\"\",null],[\"\",null],[\"\",null],[\"\",null],[\"\",null],[\"\",null],[\"\",null],[\"\",null],[\"\",null],[\"\",null],[\"\",null],[\"\",null],[\"\",null],[\"\",null],[\"\",null],[\"\",null],[\"\",null],[\"\",null]]}"},".",{"$f":"_xll.ECOPORTFOLIO(\"P\",$F$10:$G$69,,\"NO\",\"Moderada\")","v":"Moderada                                                                                                     <EcoPortfolio>{\"type\":\"P\",\"tolerance\":null,\"rebalance\":\"NO\",\"name\":\"Moderada\",\"data\":[[null,\"2024-09-24\"],[\"CDI Acumulado\",20.0],[\"IDA DI\",20.0],[\"IRF-M\",20.0],[\"IMA-B\",15.0],[\"IBXX\",5.0],[\"SMLL<xbsp>\",5.0],[\"BDRX\",5.0],[\"IFIX\",5.0],[\"DOLOF\",5.0],[\"ABEV3<XBSP>\",null],[\"BRML3<XBSP>\",null],[\"BBDC4<XBSP>\",null],[\"024813\",null],[\"267163\",null],[\"219436\",null],[\"\",null],[\"\",null],[\"\",null],[\"\",null],[\"\",null],[\"\",null],[\"\",null],[\"\",null],[\"\",null],[\"\",null],[\"\",null],[\"\",null],[\"\",null],[\"\",null],[\"\",null],[\"\",null],[\"\",null],[\"\",null],[\"\",null],[\"\",null],[\"\",null],[\"\",null],[\"\",null],[\"\",null],[\"\",null],[\"\",null],[\"\",null],[\"\",null],[\"\",null],[\"\",null],[\"\",null],[\"\",null],[\"\",null],[\"\",null],[\"\",null],[\"\",null],[\"\",null],[\"\",null],[\"\",null],[\"\",null],[\"\",null],[\"\",null],[\"\",null],[\"\",null]]}"},".",{"$f":"_xll.ECOPORTFOLIO(\"P\",$H$10:$I$69,,\"NO\",\"Agressiva\")","v":"Agressiva                                                                                                     <EcoPortfolio>{\"type\":\"P\",\"tolerance\":null,\"rebalance\":\"NO\",\"name\":\"Agressiva\",\"data\":[[null,\"2024-09-24\"],[\"CDI Acumulado\",5.0],[\"IDA DI\",5.0],[\"IRF-M\",15.0],[\"IMA-B\",10.0],[\"IBXX\",15.0],[\"SMLL<xbsp>\",15.0],[\"BDRX\",10.0],[\"IFIX\",15.0],[\"DOLOF\",10.0],[\"ABEV3<XBSP>\",null],[\"BRML3<XBSP>\",null],[\"BBDC4<XBSP>\",null],[\"024813\",null],[\"267163\",null],[\"219436\",null],[\"\",null],[\"\",null],[\"\",null],[\"\",null],[\"\",null],[\"\",null],[\"\",null],[\"\",null],[\"\",null],[\"\",null],[\"\",null],[\"\",null],[\"\",null],[\"\",null],[\"\",null],[\"\",null],[\"\",null],[\"\",null],[\"\",null],[\"\",null],[\"\",null],[\"\",null],[\"\",null],[\"\",null],[\"\",null],[\"\",null],[\"\",null],[\"\",null],[\"\",null],[\"\",null],[\"\",null],[\"\",null],[\"\",null],[\"\",null],[\"\",null],[\"\",null],[\"\",null],[\"\",null],[\"\",null],[\"\",null],[\"\",null],[\"\",null],[\"\",null],[\"\",null]]}"},null,{"$f":"$G$8","v":"Moderada                                                                                                     <EcoPortfolio>{\"type\":\"P\",\"tolerance\":null,\"rebalance\":\"NO\",\"name\":\"Moderada\",\"data\":[[null,\"2024-09-24\"],[\"CDI Acumulado\",20.0],[\"IDA DI\",20.0],[\"IRF-M\",20.0],[\"IMA-B\",15.0],[\"IBXX\",5.0],[\"SMLL<xbsp>\",5.0],[\"BDRX\",5.0],[\"IFIX\",5.0],[\"DOLOF\",5.0],[\"ABEV3<XBSP>\",null],[\"BRML3<XBSP>\",null],[\"BBDC4<XBSP>\",null],[\"024813\",null],[\"267163\",null],[\"219436\",null],[\"\",null],[\"\",null],[\"\",null],[\"\",null],[\"\",null],[\"\",null],[\"\",null],[\"\",null],[\"\",null],[\"\",null],[\"\",null],[\"\",null],[\"\",null],[\"\",null],[\"\",null],[\"\",null],[\"\",null],[\"\",null],[\"\",null],[\"\",null],[\"\",null],[\"\",null],[\"\",null],[\"\",null],[\"\",null],[\"\",null],[\"\",null],[\"\",null],[\"\",null],[\"\",null],[\"\",null],[\"\",null],[\"\",null],[\"\",null],[\"\",null],[\"\",null],[\"\",null],[\"\",null],[\"\",null],[\"\",null],[\"\",null],[\"\",null],[\"\",null],[\"\",null]]}"},"-",0.33473611323000002,3.3641078634000003E-2,null,"% CDI",{"$f":"IFERROR(_xll.ECONOMATICA($Q$6,\"PREMIUM\",$P$6,$E$2,,,,\"DECIMAL\"),\"-\")","v":0.79195136016000001},{"$f":"IFERROR(_xll.ECONOMATICA($R$6,\"PREMIUM\",$P$6,$E$2,,,,\"DECIMAL\"),\"-\")","v":0.76512624918000005},{"$f":"IFERROR(_xll.ECONOMATICA($S$6,\"PREMIUM\",$P$6,$E$2,,,,\"DECIMAL\"),\"-\")","v":0.49222957068000001}]
[null,"CDI Acumulado",null,"Dta. Preferência →",null,null,null,null,null,null,{"$f":"$I$8","v":"Agressiva                                                                                                     <EcoPortfolio>{\"type\":\"P\",\"tolerance\":null,\"rebalance\":\"NO\",\"name\":\"Agressiva\",\"data\":[[null,\"2024-09-24\"],[\"CDI Acumulado\",5.0],[\"IDA DI\",5.0],[\"IRF-M\",15.0],[\"IMA-B\",10.0],[\"IBXX\",15.0],[\"SMLL<xbsp>\",15.0],[\"BDRX\",10.0],[\"IFIX\",15.0],[\"DOLOF\",10.0],[\"ABEV3<XBSP>\",null],[\"BRML3<XBSP>\",null],[\"BBDC4<XBSP>\",null],[\"024813\",null],[\"267163\",null],[\"219436\",null],[\"\",null],[\"\",null],[\"\",null],[\"\",null],[\"\",null],[\"\",null],[\"\",null],[\"\",null],[\"\",null],[\"\",null],[\"\",null],[\"\",null],[\"\",null],[\"\",null],[\"\",null],[\"\",null],[\"\",null],[\"\",null],[\"\",null],[\"\",null],[\"\",null],[\"\",null],[\"\",null],[\"\",null],[\"\",null],[\"\",null],[\"\",null],[\"\",null],[\"\",null],[\"\",null],[\"\",null],[\"\",null],[\"\",null],[\"\",null],[\"\",null],[\"\",null],[\"\",null],[\"\",null],[\"\",null],[\"\",null],[\"\",null],[\"\",null],[\"\",null],[\"\",null]]}"},"-",0.21534617781000001,7.5383982934999996E-2,null,"VOLATILIDADE",{"$f":"IFERROR(_xll.ECONOMATICA($Q$6,\"VOLATILITY\",$P$6,$E$2,,,,\"DECIMAL\"),\"-\")","v":2.1095853958999999E-2},{"$f":"IFERROR(_xll.ECONOMATICA($R$6,\"VOLATILITY\",$P$6,$E$2,,,,\"DECIMAL\"),\"-\")","v":3.3641078634000003E-2},{"$f":"IFERROR(_xll.ECONOMATICA($S$6,\"VOLATILITY\",$P$6,$E$2,,,,\"DECIMAL\"),\"-\")","v":7.5383982934999996E-2}]
[null,"IBOV",null,null,{"$f":"IF(E9=\"\",_xll.ECONOMATICA(\"ibov\",\"date of last quote\"),E9)","v":"2024-09-24"},null,{"$f":"IF(G9=\"\",_xll.ECONOMATICA(\"ibov\",\"date of last quote\"),G9)","v":"2024-09-24"},null,{"$f":"IF(I9=\"\",_xll.ECONOMATICA(\"ibov\",\"date of last quote\"),I9)","v":"2024-09-24"},null,{"$f":"_xll.ECONOMATICA($D$11:$D$89,\"Name\",,,,,,,\"false\",\"false\")","v":"CDI"},{"$f":"_xll.ECONOMATICA($D$11:$D$69,\"Class\",,,,,,,\"false\",\"false\")","v":"Acumul"},{"$f":"IFERROR(_xll.ECONOMATICA($D$11:$D$116,\"return\",$P$6,$E$2,,,,\"decimal\",\"false\",\"false\"),\"\")","v":0.43749134680000001},{"$f":"IFERROR(_xll.ECONOMATICA($D$11:$D$89,\"volatility\",$P$6,$E$2,,,,\"decimal\",\"false\",\"false\"),\"\")","v":2.4728182510000002E-3},null,"VAR 95%",{"$f":"IFERROR(-_xll.ECONOMATICA($Q$6,\"VAR %\",$P$6,$E$2,,,,\"DECIMAL\"),\"-\")","v":-2.1795307624000002E-3},{"$f":"IFERROR(-_xll.ECONOMATICA($R$6,\"VAR %\",$P$6,$E$2,,,,\"DECIMAL\"),\"-\")","v":-3.4754646651999998E-3},{"$f":"IFERROR(-_xll.ECONOMATICA($S$6,\"VAR %\",$P$6,$E$2,,,,\"DECIMAL\"),\"-\")","v":-7.7835453218999999E-3}]
[null,"IBRA",null,"CDI Acumulado",40,{"$f":"IF(D11=\"\",\"\",D11)","v":"CDI Acumulado"},20,{"$f":"IF(D11=\"\",\"\",D11)","v":"CDI Acumulado"},5,null,"Ida DI","DI",0.55140677522000003,5.7931259808999998E-3,null,"SHARPE",{"$f":"IFERROR(_xll.ECONOMATICA($Q$6,\"SHARPE\",$P$6,$E$2,,,,),\"-\")","v":-0.76471940290999996},{"$f":"IFERROR(_xll.ECONOMATICA($R$6,\"SHARPE\",$P$6,$E$2,,,,),\"-\")","v":-0.53204154236000001},{"$f":"IFERROR(_xll.ECONOMATICA($S$6,\"SHARPE\",$P$6,$E$2,,,,),\"-\")","v":-0.51130569954000005}]
[null,"IBXL",null,"IDA DI",25,{"$f":"IF(D12=\"\",\"\",D12)","v":"IDA DI"},20,{"$f":"IF(D12=\"\",\"\",D12)","v":"IDA DI"},5,null,"Ind RF-M Tot","Tot",0.31270263656000002,3.188486301E-2,null,"MESES +",{"$f":"IFERROR(_xll.ECONOMATICA($Q$6,\"Number Return\",$P$6,$E$2,,,,,,,,{\"std.tec.dret.noprc=true\"}),\"-\")","v":40},{"$f":"IFERROR(_xll.ECONOMATICA($R$6,\"Number Return\",$P$6,$E$2,,,,,,,,{\"std.tec.dret.noprc=true\"}),\"-\")","v":32},{"$f":"IFERROR(_xll.ECONOMATICA($S$6,\"Number Return\",$P$6,$E$2,,,,,,,,{\"std.tec.dret.noprc=true\"}),\"-\")","v":25}]
[null,"IBXX",null,"IRF-M",15,"IRF-M",20,"IRF-M",15,null,"Ima-B Tot","Tot",0.30852711625000001,4.9961441836000001E-2,null,"MESES -",{"$f":"IFERROR(_xll.ECONOMATICA($Q$6,\"Number Return\",$P$6,$E$2,,,,,,,,{\"std.tec.dret.cmp=-1\";\"std.tec.dret.noprc=true\"}),\"-\")","v":8},{"$f":"IFERROR(_xll.ECONOMATICA($R$6,\"Number Return\",$P$6,$E$2,,,,,,,,{\"std.tec.dret.cmp=-1\";\"std.tec.dret.noprc=true\"}),\"-\")","v":16},{"$f":"IFERROR(_xll.ECONOMATICA($S$6,\"Number Return\",$P$6,$E$2,,,,,,,,{\"std.tec.dret.cmp=-1\";\"std.tec.dret.noprc=true\"}),\"-\")","v":23}]
[null,"ICO2",null,"IMA-B",5,"IMA-B",15,"IMA-B",10,null,"Ibrx Brasil",null,0.35545343467000001,0.18694664636,null,"> CDI",{"$f":"IFERROR(_xll.ECONOMATICA($Q$6,\"Number Premium\",$P$6,$E$2,,,,,,,,{\"std.tec.dret.noprc=true\"}),\"-\")","v":20},{"$f":"IFERROR(_xll.ECONOMATICA($R$6,\"Number Premium\",$P$6,$E$2,,,,,,,,{\"std.tec.dret.noprc=true\"}),\"-\")","v":21},{"$f":"IFERROR(_xll.ECONOMATICA($S$6,\"Number Premium\",$P$6,$E$2,,,,,,,,{\"std.tec.dret.noprc=true\"}),\"-\")","v":21}]
[null,"ICON",null,"IBXX",0,"IBXX",5,"IBXX",15,null,"Small Cap",null,-0.13269793792000001,0.24244081341000001,null,"< CDI",{"$f":"IFERROR(_xll.ECONOMATICA($Q$6,\"Number Premium\",$P$6,$E$2,,,,,,,,{\"std.tec.dret.cmp=-1\";\"std.tec.dret.noprc=true\"}),\"-\")","v":28},{"$f":"IFERROR(_xll.ECONOMATICA($R$6,\"Number Premium\",$P$6,$E$2,,,,,,,,{\"std.tec.dret.cmp=-1\";\"std.tec.dret.noprc=true\"}),\"-\")","v":27},{"$f":"IFERROR(_xll.ECONOMATICA($S$6,\"Number Premium\",$P$6,$E$2,,,,,,,,{\"std.tec.dret.cmp=-1\";\"std.tec.dret.noprc=true\"}),\"-\")","v":27}]
[null,"IDA DI",null,"SMLL<xbsp>",5,"SMLL<xbsp>",5,"SMLL<xbsp>",15,null,"Bdrx",null,0.88743497847999997,0.20165646661]
[null,"IDA Geral",null,"BDRX",0,"BDRX",5,"BDRX",10,null,"Ind Fdo Imob",null,0.18424344971000001,5.0137858652000003E-2]
[null,"IDA IPCA",null,"IFIX",5,"IFIX",5,"IFIX",15,null,"Dolar Ptax Venda",null,-1.8164195713E-2,0.13832555869999999]
[null,"IDIV",null,"DOLOF",5,"DOLOF",5,"DOLOF",10,null,"Ambev S/A","ON",0.19543799142000001,0.25199845149]
[null,"IDKA IPCA 10A",null,"ABEV3<XBSP>",null,"ABEV3<XBSP>",null,"ABEV3<XBSP>",null,null,"BR Malls Par","ON"]
[null,"IDKA IPCA 15A",null,"BRML3<XBSP>",null,"BRML3<XBSP>",null,"BRML3<XBSP>",null,null,"Bradesco","PN",0.10884021688000001,0.31871557274000001]
[null,"IDKA IPCA 20A",null,"BBDC4<XBSP>",null,"BBDC4<XBSP>",null,"BBDC4<XBSP>",null,null,"Fama Fc FIA",null,-0.34031020032999998,0.25526175970999998]
[null,"IDKA IPCA 2A",null,"024813",null,"024813",null,"024813",null,null,"Alaska Black FIC FIA Bdr Nivel I",null,9.4204855658999997E-2,0.40259373371000001,null,null,null,null,null,null,"Dispersão de Risco x Retorno"]
[null,"IDKA IPCA 3A",null,"267163",null,"267163",null,"267163",null,null,"Brasil Capital Fc FIA",null,7.1636786578999995E-2,0.20873769276000001]
[null,"IDKA IPCA 5A",null,"219436",null,"219436",null,"219436"]
[null,"IDKA PRE 1A",null,null,null,"",null,""]
[null,"IDKA PRE 2A",null,null,null,"",null,""]
[null,"IDKA PRE 3A",null,null,null,"",null,""]
[null,"IDKA PRE 3M",null,null,null,"",null,""]
[null,"IDKA PRE 5A",null,null,null,"",null,""]
[null,"IEEX",null,null,null,"",null,""]
[null,"IFIX",null,null,null,"",null,""]
[null,"IFNC",null,null,null,"",null,""]
[null,"IGCT",null,null,null,"",null,""]
[null,"IGNM",null,null,null,"",null,""]
[null,"IGPDI",null,null,null,"",null,""]
[null,"IGPM",null,null,null,"",null,""]
[null,"IHFA",null,null,null,"",null,""]
[null,"IMA ex-C",null,null,null,"",null,""]
[null,"IMA-B",null,null,null,"",null,""]
[null,"IMA-B 5",null,null,null,"",null,""]
[null,"IMA-B 5+",null,null,null,"",null,""]
[null,"IMA-C",null,null,null,"",null,""]
[null,"IMA-G",null,null,null,"",null,"",null,null,null,null,null,null,null,null,null,null,null,null,"Percepção Anual do Retorno das Carteiras"]
[null,"IMA-S",null,null,null,"",null,""]
[null,"IMAT",null,null,null,"",null,"",null,null,null,null,null,null,null,null,null,null,null,null,"Rank",{"$f":"E2","v":"2024-09-24"},{"$f":"DATE(YEAR(V46)-1,12,31)","v":"2023-12-31"},{"$f":"DATE(YEAR(W46)-1,12,31)","v":"2022-12-31"},"2021-12-31","2020-12-31","2019-12-31","2018-12-31","2017-12-31","2016-12-31","2015-12-31"]
[null,"IMOB",null,null,null,"",null,"",null,null,null,null,null,null,null,null,null,null,null,null,{"$f":"IF(Anual!D4=\"\",\"\",1)","v":1},{"$f":"IFERROR(LARGE(Anual!D$4:D$65,'Lâmina Cart. Hip. Cons. Mod. Ag'!$U$47),\"\")","v":0.41865099517999999},{"$f":"IFERROR(LARGE(Anual!E$4:E$65,'Lâmina Cart. Hip. Cons. Mod. Ag'!$U$47),\"\")","v":0.58741959998000004},{"$f":"IFERROR(LARGE(Anual!F$4:F$65,'Lâmina Cart. Hip. Cons. Mod. Ag'!$U$47),\"\")","v":0.14562793867000001},{"$f":"IFERROR(LARGE(Anual!G$4:G$65,'Lâmina Cart. Hip. Cons. Mod. Ag'!$U$47),\"\")","v":0.33652056493999999},{"$f":"IFERROR(LARGE(Anual!H$4:H$65,'Lâmina Cart. Hip. Cons. Mod. Ag'!$U$47),\"\")","v":0.54008861744000003},{"$f":"IFERROR(LARGE(Anual!I$4:I$65,'Lâmina Cart. Hip. Cons. Mod. Ag'!$U$47),\"\")","v":0.58197278153999998},{"$f":"IFERROR(LARGE(Anual!J$4:J$65,'Lâmina Cart. Hip. Cons. Mod. Ag'!$U$47),\"\")","v":0.30370689887000002},{"$f":"IFERROR(LARGE(Anual!K$4:K$65,'Lâmina Cart. Hip. Cons. Mod. Ag'!$U$47),\"\")","v":0.74617918080000001},{"$f":"IFERROR(LARGE(Anual!L$4:L$65,'Lâmina Cart. Hip. Cons. Mod. Ag'!$U$47),\"\")","v":1.2920855516},{"$f":"IFERROR(LARGE(Anual!M$4:M$65,'Lâmina Cart. Hip. Cons. Mod. Ag'!$U$47),\"\")","v":0.52290076336000002}]
[null,"INCC-DI",null,null,null,"",null,"",null,null,null,null,null,null,null,null,null,null,null,null,null,{"$f":"IFERROR(INDEX(Anual!$C$4:$C$65,MATCH('Lâmina Cart. Hip. Cons. Mod. Ag'!V47,Anual!D$4:D$65,0)),\"\")","v":"Bdrx"},{"$f":"IFERROR(INDEX(Anual!$C$4:$C$65,MATCH('Lâmina Cart. Hip. Cons. Mod. Ag'!W47,Anual!E$4:E$65,0)),\"\")","v":"Alaska Black FIC FIA Bdr Nivel I"},{"$f":"IFERROR(INDEX(Anual!$C$4:$C$65,MATCH('Lâmina Cart. Hip. Cons. Mod. Ag'!X47,Anual!F$4:F$65,0)),\"\")","v":"Ida DI"},{"$f":"IFERROR(INDEX(Anual!$C$4:$C$65,MATCH('Lâmina Cart. Hip. Cons. Mod. Ag'!Y47,Anual!G$4:G$65,0)),\"\")","v":"Bdrx"},{"$f":"IFERROR(INDEX(Anual!$C$4:$C$65,MATCH('Lâmina Cart. Hip. Cons. Mod. Ag'!Z47,Anual!H$4:H$65,0)),\"\")","v":"Bdrx"},{"$f":"IFERROR(INDEX(Anual!$C$4:$C$65,MATCH('Lâmina Cart. Hip. Cons. Mod. Ag'!AA47,Anual!I$4:I$65,0)),\"\")","v":"Small Cap"},{"$f":"IFERROR(INDEX(Anual!$C$4:$C$65,MATCH('Lâmina Cart. Hip. Cons. Mod. Ag'!AB47,Anual!J$4:J$65,0)),\"\")","v":"Alaska Black FIC FIA Bdr Nivel I"},{"$f":"IFERROR(INDEX(Anual!$C$4:$C$65,MATCH('Lâmina Cart. Hip. Cons. Mod. Ag'!AC47,Anual!K$4:K$65,0)),\"\")","v":"Alaska Black FIC FIA Bdr Nivel I"},{"$f":"IFERROR(INDEX(Anual!$C$4:$C$65,MATCH('Lâmina Cart. Hip. Cons. Mod. Ag'!AD47,Anual!L$4:L$65,0)),\"\")","v":"Alaska Black FIC FIA Bdr Nivel I"},{"$f":"IFERROR(INDEX(Anual!$C$4:$C$65,MATCH('Lâmina Cart. Hip. Cons. Mod. Ag'!AE47,Anual!M$4:M$65,0)),\"\")","v":"Bdrx"}]
[null,"INDX",null,null,null,"",null,"",null,null,null,null,null,null,null,null,null,null,null,null,{"$f":"IF(Anual!D5=\"\",\"\",U47+1)","v":2},{"$f":"IFERROR(LARGE(Anual!D$4:D$65,'Lâmina Cart. Hip. Cons. Mod. Ag'!$U$49),\"\")","v":0.12990312519},{"$f":"IFERROR(LARGE(Anual!E$4:E$65,'Lâmina Cart. Hip. Cons. Mod. Ag'!$U$49),\"\")","v":0.30826731624999998},{"$f":"IFERROR(LARGE(Anual!F$4:F$65,'Lâmina Cart. Hip. Cons. Mod. Ag'!$U$49),\"\")","v":0.12391019239999999},{"$f":"IFERROR(LARGE(Anual!G$4:G$65,'Lâmina Cart. Hip. Cons. Mod. Ag'!$U$49),\"\")","v":7.5814468245999994E-2},{"$f":"IFERROR(LARGE(Anual!H$4:H$65,'Lâmina Cart. Hip. Cons. Mod. Ag'!$U$49),\"\")","v":0.28927977771000002},{"$f":"IFERROR(LARGE(Anual!I$4:I$65,'Lâmina Cart. Hip. Cons. Mod. Ag'!$U$49),\"\")","v":0.56152552181000004},{"$f":"IFERROR(LARGE(Anual!J$4:J$65,'Lâmina Cart. Hip. Cons. Mod. Ag'!$U$49),\"\")","v":0.29886839549999999},{"$f":"IFERROR(LARGE(Anual!K$4:K$65,'Lâmina Cart. Hip. Cons. Mod. Ag'!$U$49),\"\")","v":0.49355215826999999},{"$f":"IFERROR(LARGE(Anual!L$4:L$65,'Lâmina Cart. Hip. Cons. Mod. Ag'!$U$49),\"\")","v":0.73700888462000003},{"$f":"IFERROR(LARGE(Anual!M$4:M$65,'Lâmina Cart. Hip. Cons. Mod. Ag'!$U$49),\"\")","v":0.47007002484999999}]
[null,"INPC",null,null,null,"",null,"",null,null,null,null,null,null,null,null,null,null,null,null,null,{"$f":"IFERROR(INDEX(Anual!$C$4:$C$65,MATCH('Lâmina Cart. Hip. Cons. Mod. Ag'!V49,Anual!D$4:D$65,0)),\"\")","v":"Dolar Ptax Venda"},{"$f":"IFERROR(INDEX(Anual!$C$4:$C$65,MATCH('Lâmina Cart. Hip. Cons. Mod. Ag'!W49,Anual!E$4:E$65,0)),\"\")","v":"Brasil Capital Fc FIA"},{"$f":"IFERROR(INDEX(Anual!$C$4:$C$65,MATCH('Lâmina Cart. Hip. Cons. Mod. Ag'!X49,Anual!F$4:F$65,0)),\"\")","v":"CDI"},{"$f":"IFERROR(INDEX(Anual!$C$4:$C$65,MATCH('Lâmina Cart. Hip. Cons. Mod. Ag'!Y49,Anual!G$4:G$65,0)),\"\")","v":"Ida DI"},{"$f":"IFERROR(INDEX(Anual!$C$4:$C$65,MATCH('Lâmina Cart. Hip. Cons. Mod. Ag'!Z49,Anual!H$4:H$65,0)),\"\")","v":"Dolar Ptax Venda"},{"$f":"IFERROR(INDEX(Anual!$C$4:$C$65,MATCH('Lâmina Cart. Hip. Cons. Mod. Ag'!AA49,Anual!I$4:I$65,0)),\"\")","v":"Brasil Capital Fc FIA"},{"$f":"IFERROR(INDEX(Anual!$C$4:$C$65,MATCH('Lâmina Cart. Hip. Cons. Mod. Ag'!AB49,Anual!J$4:J$65,0)),\"\")","v":"Bradesco"},{"$f":"IFERROR(INDEX(Anual!$C$4:$C$65,MATCH('Lâmina Cart. Hip. Cons. Mod. Ag'!AC49,Anual!K$4:K$65,0)),\"\")","v":"Small Cap"},{"$f":"IFERROR(INDEX(Anual!$C$4:$C$65,MATCH('Lâmina Cart. Hip. Cons. Mod. Ag'!AD49,Anual!L$4:L$65,0)),\"\")","v":"Bradesco"},{"$f":"IFERROR(INDEX(Anual!$C$4:$C$65,MATCH('Lâmina Cart. Hip. Cons. Mod. Ag'!AE49,Anual!M$4:M$65,0)),\"\")","v":"Dolar Ptax Venda"}]
[null,"IPC",null,null,null,"",null,"",null,null,null,null,null,null,null,null,null,null,null,null,{"$f":"IF(Anual!D6=\"\",\"\",U49+1)","v":3},{"$f":"IFERROR(LARGE(Anual!D$4:D$65,'Lâmina Cart. Hip. Cons. Mod. Ag'!$U$51),\"\")","v":0.1034230183},{"$f":"IFERROR(LARGE(Anual!E$4:E$65,'Lâmina Cart. Hip. Cons. Mod. Ag'!$U$51),\"\")","v":0.26333491471999998},{"$f":"IFERROR(LARGE(Anual!F$4:F$65,'Lâmina Cart. Hip. Cons. Mod. Ag'!$U$51),\"\")","v":9.0991394697999994E-2},{"$f":"IFERROR(LARGE(Anual!G$4:G$65,'Lâmina Cart. Hip. Cons. Mod. Ag'!$U$51),\"\")","v":7.3854561548000006E-2},{"$f":"IFERROR(LARGE(Anual!H$4:H$65,'Lâmina Cart. Hip. Cons. Mod. Ag'!$U$51),\"\")","v":6.6946328425000007E-2},{"$f":"IFERROR(LARGE(Anual!I$4:I$65,'Lâmina Cart. Hip. Cons. Mod. Ag'!$U$51),\"\")","v":0.47753104831999998},{"$f":"IFERROR(LARGE(Anual!J$4:J$65,'Lâmina Cart. Hip. Cons. Mod. Ag'!$U$51),\"\")","v":0.17134220073},{"$f":"IFERROR(LARGE(Anual!K$4:K$65,'Lâmina Cart. Hip. Cons. Mod. Ag'!$U$51),\"\")","v":0.45030668741000002},{"$f":"IFERROR(LARGE(Anual!L$4:L$65,'Lâmina Cart. Hip. Cons. Mod. Ag'!$U$51),\"\")","v":0.55240778748999997},{"$f":"IFERROR(LARGE(Anual!M$4:M$65,'Lâmina Cart. Hip. Cons. Mod. Ag'!$U$51),\"\")","v":0.14113721473999999}]
[null,"IPCA",null,null,null,"",null,"",null,null,null,null,null,null,null,null,null,null,null,null,null,{"$f":"IFERROR(INDEX(Anual!$C$4:$C$65,MATCH('Lâmina Cart. Hip. Cons. Mod. Ag'!V51,Anual!D$4:D$65,0)),\"\")","v":"Ida DI"},{"$f":"IFERROR(INDEX(Anual!$C$4:$C$65,MATCH('Lâmina Cart. Hip. Cons. Mod. Ag'!W51,Anual!E$4:E$65,0)),\"\")","v":"Bdrx"},{"$f":"IFERROR(INDEX(Anual!$C$4:$C$65,MATCH('Lâmina Cart. Hip. Cons. Mod. Ag'!X51,Anual!F$4:F$65,0)),\"\")","v":"Alaska Black FIC FIA Bdr Nivel I"},{"$f":"IFERROR(INDEX(Anual!$C$4:$C$65,MATCH('Lâmina Cart. Hip. Cons. Mod. Ag'!Y51,Anual!G$4:G$65,0)),\"\")","v":"Dolar Ptax Venda"},{"$f":"IFERROR(INDEX(Anual!$C$4:$C$65,MATCH('Lâmina Cart. Hip. Cons. Mod. Ag'!Z51,Anual!H$4:H$65,0)),\"\")","v":"Ind RF-M Tot"},{"$f":"IFERROR(INDEX(Anual!$C$4:$C$65,MATCH('Lâmina Cart. Hip. Cons. Mod. Ag'!AA51,Anual!I$4:I$65,0)),\"\")","v":"BR Malls Par"},{"$f":"IFERROR(INDEX(Anual!$C$4:$C$65,MATCH('Lâmina Cart. Hip. Cons. Mod. Ag'!AB51,Anual!J$4:J$65,0)),\"\")","v":"Dolar Ptax Venda"},{"$f":"IFERROR(INDEX(Anual!$C$4:$C$65,MATCH('Lâmina Cart. Hip. Cons. Mod. Ag'!AC51,Anual!K$4:K$65,0)),\"\")","v":"Fama Fc FIA"},{"$f":"IFERROR(INDEX(Anual!$C$4:$C$65,MATCH('Lâmina Cart. Hip. Cons. Mod. Ag'!AD51,Anual!L$4:L$65,0)),\"\")","v":"Fama Fc FIA"},{"$f":"IFERROR(INDEX(Anual!$C$4:$C$65,MATCH('Lâmina Cart. Hip. Cons. Mod. Ag'!AE51,Anual!M$4:M$65,0)),\"\")","v":"Ida DI"}]
[null,"IRF-M",null,null,null,"",null,"",null,null,null,null,null,null,null,null,null,null,null,null,{"$f":"IF(Anual!D7=\"\",\"\",U51+1)","v":4},{"$f":"IFERROR(LARGE(Anual!D$4:D$65,'Lâmina Cart. Hip. Cons. Mod. Ag'!$U$53),\"\")","v":7.8130739214000003E-2},{"$f":"IFERROR(LARGE(Anual!E$4:E$65,'Lâmina Cart. Hip. Cons. Mod. Ag'!$U$53),\"\")","v":0.25648371255000002},{"$f":"IFERROR(LARGE(Anual!F$4:F$65,'Lâmina Cart. Hip. Cons. Mod. Ag'!$U$53),\"\")","v":8.8247019412E-2},{"$f":"IFERROR(LARGE(Anual!G$4:G$65,'Lâmina Cart. Hip. Cons. Mod. Ag'!$U$53),\"\")","v":4.4236266726999998E-2},{"$f":"IFERROR(LARGE(Anual!H$4:H$65,'Lâmina Cart. Hip. Cons. Mod. Ag'!$U$53),\"\")","v":6.4056041667000005E-2},{"$f":"IFERROR(LARGE(Anual!I$4:I$65,'Lâmina Cart. Hip. Cons. Mod. Ag'!$U$53),\"\")","v":0.41552706342000001},{"$f":"IFERROR(LARGE(Anual!J$4:J$65,'Lâmina Cart. Hip. Cons. Mod. Ag'!$U$53),\"\")","v":0.15420767966000001},{"$f":"IFERROR(LARGE(Anual!K$4:K$65,'Lâmina Cart. Hip. Cons. Mod. Ag'!$U$53),\"\")","v":0.34549128328000001},{"$f":"IFERROR(LARGE(Anual!L$4:L$65,'Lâmina Cart. Hip. Cons. Mod. Ag'!$U$53),\"\")","v":0.39954954954999999},{"$f":"IFERROR(LARGE(Anual!M$4:M$65,'Lâmina Cart. Hip. Cons. Mod. Ag'!$U$53),\"\")","v":0.13651612988}]
[null,"IRF-M 1",null,null,null,"",null,"",null,null,null,null,null,null,null,null,null,null,null,null,null,{"$f":"IFERROR(INDEX(Anual!$C$4:$C$65,MATCH('Lâmina Cart. Hip. Cons. Mod. Ag'!V53,Anual!D$4:D$65,0)),\"\")","v":"CDI"},{"$f":"IFERROR(INDEX(Anual!$C$4:$C$65,MATCH('Lâmina Cart. Hip. Cons. Mod. Ag'!W53,Anual!E$4:E$65,0)),\"\")","v":"Bradesco"},{"$f":"IFERROR(INDEX(Anual!$C$4:$C$65,MATCH('Lâmina Cart. Hip. Cons. Mod. Ag'!X53,Anual!F$4:F$65,0)),\"\")","v":"Ind RF-M Tot"},{"$f":"IFERROR(INDEX(Anual!$C$4:$C$65,MATCH('Lâmina Cart. Hip. Cons. Mod. Ag'!Y53,Anual!G$4:G$65,0)),\"\")","v":"CDI"},{"$f":"IFERROR(INDEX(Anual!$C$4:$C$65,MATCH('Lâmina Cart. Hip. Cons. Mod. Ag'!Z53,Anual!H$4:H$65,0)),\"\")","v":"Ima-B Tot"},{"$f":"IFERROR(INDEX(Anual!$C$4:$C$65,MATCH('Lâmina Cart. Hip. Cons. Mod. Ag'!AA53,Anual!I$4:I$65,0)),\"\")","v":"Fama Fc FIA"},{"$f":"IFERROR(INDEX(Anual!$C$4:$C$65,MATCH('Lâmina Cart. Hip. Cons. Mod. Ag'!AB53,Anual!J$4:J$65,0)),\"\")","v":"Ibrx Brasil"},{"$f":"IFERROR(INDEX(Anual!$C$4:$C$65,MATCH('Lâmina Cart. Hip. Cons. Mod. Ag'!AC53,Anual!K$4:K$65,0)),\"\")","v":"Brasil Capital Fc FIA"},{"$f":"IFERROR(INDEX(Anual!$C$4:$C$65,MATCH('Lâmina Cart. Hip. Cons. Mod. Ag'!AD53,Anual!L$4:L$65,0)),\"\")","v":"BR Malls Par"},{"$f":"IFERROR(INDEX(Anual!$C$4:$C$65,MATCH('Lâmina Cart. Hip. Cons. Mod. Ag'!AE53,Anual!M$4:M$65,0)),\"\")","v":"Ambev S/A"}]
[null,"IRF-M 1+",null,null,null,"",null,"",null,null,null,null,null,null,null,null,null,null,null,null,{"$f":"IF(Anual!D8=\"\",\"\",U53+1)","v":5},{"$f":"IFERROR(LARGE(Anual!D$4:D$65,'Lâmina Cart. Hip. Cons. Mod. Ag'!$U$55),\"\")","v":6.0451479928999997E-2},{"$f":"IFERROR(LARGE(Anual!E$4:E$65,'Lâmina Cart. Hip. Cons. Mod. Ag'!$U$55),\"\")","v":0.21274740375000001},{"$f":"IFERROR(LARGE(Anual!F$4:F$65,'Lâmina Cart. Hip. Cons. Mod. Ag'!$U$55),\"\")","v":8.1928088390000001E-2},{"$f":"IFERROR(LARGE(Anual!G$4:G$65,'Lâmina Cart. Hip. Cons. Mod. Ag'!$U$55),\"\")","v":2.8635677389000001E-2},{"$f":"IFERROR(LARGE(Anual!H$4:H$65,'Lâmina Cart. Hip. Cons. Mod. Ag'!$U$55),\"\")","v":5.4695856748000003E-2},{"$f":"IFERROR(LARGE(Anual!I$4:I$65,'Lâmina Cart. Hip. Cons. Mod. Ag'!$U$55),\"\")","v":0.36481571786},{"$f":"IFERROR(LARGE(Anual!J$4:J$65,'Lâmina Cart. Hip. Cons. Mod. Ag'!$U$55),\"\")","v":0.13058738172000001},{"$f":"IFERROR(LARGE(Anual!K$4:K$65,'Lâmina Cart. Hip. Cons. Mod. Ag'!$U$55),\"\")","v":0.33457329527000002},{"$f":"IFERROR(LARGE(Anual!L$4:L$65,'Lâmina Cart. Hip. Cons. Mod. Ag'!$U$55),\"\")","v":0.36701042298999997},{"$f":"IFERROR(LARGE(Anual!M$4:M$65,'Lâmina Cart. Hip. Cons. Mod. Ag'!$U$55),\"\")","v":0.13239194386}]
[null,"ISEE",null,null,null,"",null,"",null,null,null,null,null,null,null,null,null,null,null,null,null,{"$f":"IFERROR(INDEX(Anual!$C$4:$C$65,MATCH('Lâmina Cart. Hip. Cons. Mod. Ag'!V55,Anual!D$4:D$65,0)),\"\")","v":"CONSERVADORA"},{"$f":"IFERROR(INDEX(Anual!$C$4:$C$65,MATCH('Lâmina Cart. Hip. Cons. Mod. Ag'!W55,Anual!E$4:E$65,0)),\"\")","v":"Ibrx Brasil"},{"$f":"IFERROR(INDEX(Anual!$C$4:$C$65,MATCH('Lâmina Cart. Hip. Cons. Mod. Ag'!X55,Anual!F$4:F$65,0)),\"\")","v":"CONSERVADORA"},{"$f":"IFERROR(INDEX(Anual!$C$4:$C$65,MATCH('Lâmina Cart. Hip. Cons. Mod. Ag'!Y55,Anual!G$4:G$65,0)),\"\")","v":"Ambev S/A"},{"$f":"IFERROR(INDEX(Anual!$C$4:$C$65,MATCH('Lâmina Cart. Hip. Cons. Mod. Ag'!Z55,Anual!H$4:H$65,0)),\"\")","v":"MODERADA"},{"$f":"IFERROR(INDEX(Anual!$C$4:$C$65,MATCH('Lâmina Cart. Hip. Cons. Mod. Ag'!AA55,Anual!I$4:I$65,0)),\"\")","v":"Alaska Black FIC FIA Bdr Nivel I"},{"$f":"IFERROR(INDEX(Anual!$C$4:$C$65,MATCH('Lâmina Cart. Hip. Cons. Mod. Ag'!AB55,Anual!J$4:J$65,0)),\"\")","v":"Ima-B Tot"},{"$f":"IFERROR(INDEX(Anual!$C$4:$C$65,MATCH('Lâmina Cart. Hip. Cons. Mod. Ag'!AC55,Anual!K$4:K$65,0)),\"\")","v":"Bradesco"},{"$f":"IFERROR(INDEX(Anual!$C$4:$C$65,MATCH('Lâmina Cart. Hip. Cons. Mod. Ag'!AD55,Anual!L$4:L$65,0)),\"\")","v":"Ibrx Brasil"},{"$f":"IFERROR(INDEX(Anual!$C$4:$C$65,MATCH('Lâmina Cart. Hip. Cons. Mod. Ag'!AE55,Anual!M$4:M$65,0)),\"\")","v":"CDI"}]
[null,"ITAG",null,null,null,"",null,"",null,null,null,null,null,null,null,null,null,null,null,null,{"$f":"IF(Anual!D10=\"\",\"\",U55+1)","v":6},{"$f":"IFERROR(LARGE(Anual!D$4:D$65,'Lâmina Cart. Hip. Cons. Mod. Ag'!$U$57),\"\")","v":5.8193909490000001E-2},{"$f":"IFERROR(LARGE(Anual!E$4:E$65,'Lâmina Cart. Hip. Cons. Mod. Ag'!$U$57),\"\")","v":0.17119619321000001},{"$f":"IFERROR(LARGE(Anual!F$4:F$65,'Lâmina Cart. Hip. Cons. Mod. Ag'!$U$57),\"\")","v":6.3692259794999997E-2},{"$f":"IFERROR(LARGE(Anual!G$4:G$65,'Lâmina Cart. Hip. Cons. Mod. Ag'!$U$57),\"\")","v":1.7513955304999999E-2},{"$f":"IFERROR(LARGE(Anual!H$4:H$65,'Lâmina Cart. Hip. Cons. Mod. Ag'!$U$57),\"\")","v":5.1792083475E-2},{"$f":"IFERROR(LARGE(Anual!I$4:I$65,'Lâmina Cart. Hip. Cons. Mod. Ag'!$U$57),\"\")","v":0.35975233777999999},{"$f":"IFERROR(LARGE(Anual!J$4:J$65,'Lâmina Cart. Hip. Cons. Mod. Ag'!$U$57),\"\")","v":0.12192594755},{"$f":"IFERROR(LARGE(Anual!K$4:K$65,'Lâmina Cart. Hip. Cons. Mod. Ag'!$U$57),\"\")","v":0.33412877546000003},{"$f":"IFERROR(LARGE(Anual!L$4:L$65,'Lâmina Cart. Hip. Cons. Mod. Ag'!$U$57),\"\")","v":0.36617998739000002},{"$f":"IFERROR(LARGE(Anual!M$4:M$65,'Lâmina Cart. Hip. Cons. Mod. Ag'!$U$57),\"\")","v":0.11719304827}]
[null,"IVBX",null,null,null,"",null,"",null,null,null,null,null,null,null,null,null,null,null,null,null,{"$f":"IFERROR(INDEX(Anual!$C$4:$C$65,MATCH('Lâmina Cart. Hip. Cons. Mod. Ag'!V57,Anual!D$4:D$65,0)),\"\")","v":"MODERADA"},{"$f":"IFERROR(INDEX(Anual!$C$4:$C$65,MATCH('Lâmina Cart. Hip. Cons. Mod. Ag'!W57,Anual!E$4:E$65,0)),\"\")","v":"Small Cap"},{"$f":"IFERROR(INDEX(Anual!$C$4:$C$65,MATCH('Lâmina Cart. Hip. Cons. Mod. Ag'!X57,Anual!F$4:F$65,0)),\"\")","v":"Ima-B Tot"},{"$f":"IFERROR(INDEX(Anual!$C$4:$C$65,MATCH('Lâmina Cart. Hip. Cons. Mod. Ag'!Y57,Anual!G$4:G$65,0)),\"\")","v":"CONSERVADORA"},{"$f":"IFERROR(INDEX(Anual!$C$4:$C$65,MATCH('Lâmina Cart. Hip. Cons. Mod. Ag'!Z57,Anual!H$4:H$65,0)),\"\")","v":"AGRESSIVA"},{"$f":"IFERROR(INDEX(Anual!$C$4:$C$65,MATCH('Lâmina Cart. Hip. Cons. Mod. Ag'!AA57,Anual!I$4:I$65,0)),\"\")","v":"Ind Fdo Imob"},{"$f":"IFERROR(INDEX(Anual!$C$4:$C$65,MATCH('Lâmina Cart. Hip. Cons. Mod. Ag'!AB57,Anual!J$4:J$65,0)),\"\")","v":"Brasil Capital Fc FIA"},{"$f":"IFERROR(INDEX(Anual!$C$4:$C$65,MATCH('Lâmina Cart. Hip. Cons. Mod. Ag'!AC57,Anual!K$4:K$65,0)),\"\")","v":"Ambev S/A"},{"$f":"IFERROR(INDEX(Anual!$C$4:$C$65,MATCH('Lâmina Cart. Hip. Cons. Mod. Ag'!AD57,Anual!L$4:L$65,0)),\"\")","v":"Brasil Capital Fc FIA"},{"$f":"IFERROR(INDEX(Anual!$C$4:$C$65,MATCH('Lâmina Cart. Hip. Cons. Mod. Ag'!AE57,Anual!M$4:M$65,0)),\"\")","v":"CONSERVADORA"}]
[null,"LFT Acumulado",null,null,null,"",null,"",null,null,null,null,null,null,null,null,null,null,null,null,{"$f":"IF(Anual!D10=\"\",\"\",U57+1)","v":7},{"$f":"IFERROR(LARGE(Anual!D$4:D$65,'Lâmina Cart. Hip. Cons. Mod. Ag'!$U$59),\"\")","v":3.9993610173000002E-2},{"$f":"IFERROR(LARGE(Anual!E$4:E$65,'Lâmina Cart. Hip. Cons. Mod. Ag'!$U$59),\"\")","v":0.16509056248000001},{"$f":"IFERROR(LARGE(Anual!F$4:F$65,'Lâmina Cart. Hip. Cons. Mod. Ag'!$U$59),\"\")","v":4.9811791892000003E-2},{"$f":"IFERROR(LARGE(Anual!G$4:G$65,'Lâmina Cart. Hip. Cons. Mod. Ag'!$U$59),\"\")","v":9.6912694697999999E-3},{"$f":"IFERROR(LARGE(Anual!H$4:H$65,'Lâmina Cart. Hip. Cons. Mod. Ag'!$U$59),\"\")","v":3.5332618268999999E-2},{"$f":"IFERROR(LARGE(Anual!I$4:I$65,'Lâmina Cart. Hip. Cons. Mod. Ag'!$U$59),\"\")","v":0.35666342897999997},{"$f":"IFERROR(LARGE(Anual!J$4:J$65,'Lâmina Cart. Hip. Cons. Mod. Ag'!$U$59),\"\")","v":0.12021907934000001},{"$f":"IFERROR(LARGE(Anual!K$4:K$65,'Lâmina Cart. Hip. Cons. Mod. Ag'!$U$59),\"\")","v":0.27545586574000003},{"$f":"IFERROR(LARGE(Anual!L$4:L$65,'Lâmina Cart. Hip. Cons. Mod. Ag'!$U$59),\"\")","v":0.32292405961999998},{"$f":"IFERROR(LARGE(Anual!M$4:M$65,'Lâmina Cart. Hip. Cons. Mod. Ag'!$U$59),\"\")","v":0.10389504594}]
[null,"MLCX",null,null,null,"",null,"",null,null,null,null,null,null,null,null,null,null,null,null,null,{"$f":"IFERROR(INDEX(Anual!$C$4:$C$65,MATCH('Lâmina Cart. Hip. Cons. Mod. Ag'!V59,Anual!D$4:D$65,0)),\"\")","v":"Ind RF-M Tot"},{"$f":"IFERROR(INDEX(Anual!$C$4:$C$65,MATCH('Lâmina Cart. Hip. Cons. Mod. Ag'!W59,Anual!E$4:E$65,0)),\"\")","v":"Ind RF-M Tot"},{"$f":"IFERROR(INDEX(Anual!$C$4:$C$65,MATCH('Lâmina Cart. Hip. Cons. Mod. Ag'!X59,Anual!F$4:F$65,0)),\"\")","v":"MODERADA"},{"$f":"IFERROR(INDEX(Anual!$C$4:$C$65,MATCH('Lâmina Cart. Hip. Cons. Mod. Ag'!Y59,Anual!G$4:G$65,0)),\"\")","v":"MODERADA"},{"$f":"IFERROR(INDEX(Anual!$C$4:$C$65,MATCH('Lâmina Cart. Hip. Cons. Mod. Ag'!Z59,Anual!H$4:H$65,0)),\"\")","v":"CONSERVADORA"},{"$f":"IFERROR(INDEX(Anual!$C$4:$C$65,MATCH('Lâmina Cart. Hip. Cons. Mod. Ag'!AA59,Anual!I$4:I$65,0)),\"\")","v":"Bdrx"},{"$f":"IFERROR(INDEX(Anual!$C$4:$C$65,MATCH('Lâmina Cart. Hip. Cons. Mod. Ag'!AB59,Anual!J$4:J$65,0)),\"\")","v":"Bdrx"},{"$f":"IFERROR(INDEX(Anual!$C$4:$C$65,MATCH('Lâmina Cart. Hip. Cons. Mod. Ag'!AC59,Anual!K$4:K$65,0)),\"\")","v":"Ibrx Brasil"},{"$f":"IFERROR(INDEX(Anual!$C$4:$C$65,MATCH('Lâmina Cart. Hip. Cons. Mod. Ag'!AD59,Anual!L$4:L$65,0)),\"\")","v":"Ind Fdo Imob"},{"$f":"IFERROR(INDEX(Anual!$C$4:$C$65,MATCH('Lâmina Cart. Hip. Cons. Mod. Ag'!AE59,Anual!M$4:M$65,0)),\"\")","v":"MODERADA"}]
[null,"OTNBTN",null,null,null,"",null,"",null,null,null,null,null,null,null,null,null,null,null,null,{"$f":"IF(Anual!D11=\"\",\"\",U59+1)","v":8},{"$f":"IFERROR(LARGE(Anual!D$4:D$65,'Lâmina Cart. Hip. Cons. Mod. Ag'!$U$61),\"\")","v":3.3366728678000002E-2},{"$f":"IFERROR(LARGE(Anual!E$4:E$65,'Lâmina Cart. Hip. Cons. Mod. Ag'!$U$61),\"\")","v":0.16054306708999999},{"$f":"IFERROR(LARGE(Anual!F$4:F$65,'Lâmina Cart. Hip. Cons. Mod. Ag'!$U$61),\"\")","v":4.0164193793E-2},{"$f":"IFERROR(LARGE(Anual!G$4:G$65,'Lâmina Cart. Hip. Cons. Mod. Ag'!$U$61),\"\")","v":-1.2642482302E-2},{"$f":"IFERROR(LARGE(Anual!H$4:H$65,'Lâmina Cart. Hip. Cons. Mod. Ag'!$U$61),\"\")","v":3.5005142225000001E-2},{"$f":"IFERROR(LARGE(Anual!I$4:I$65,'Lâmina Cart. Hip. Cons. Mod. Ag'!$U$61),\"\")","v":0.33388633988999999},{"$f":"IFERROR(LARGE(Anual!J$4:J$65,'Lâmina Cart. Hip. Cons. Mod. Ag'!$U$61),\"\")","v":0.10732164978},{"$f":"IFERROR(LARGE(Anual!K$4:K$65,'Lâmina Cart. Hip. Cons. Mod. Ag'!$U$61),\"\")","v":0.24071158212999999},{"$f":"IFERROR(LARGE(Anual!L$4:L$65,'Lâmina Cart. Hip. Cons. Mod. Ag'!$U$61),\"\")","v":0.31753554501999998},{"$f":"IFERROR(LARGE(Anual!M$4:M$65,'Lâmina Cart. Hip. Cons. Mod. Ag'!$U$61),\"\")","v":8.8815324614000005E-2}]
[null,"PoupAcum",null,null,null,"",null,"",null,null,null,null,null,null,null,null,null,null,null,null,null,{"$f":"IFERROR(INDEX(Anual!$C$4:$C$65,MATCH('Lâmina Cart. Hip. Cons. Mod. Ag'!V61,Anual!D$4:D$65,0)),\"\")","v":"AGRESSIVA"},{"$f":"IFERROR(INDEX(Anual!$C$4:$C$65,MATCH('Lâmina Cart. Hip. Cons. Mod. Ag'!W61,Anual!E$4:E$65,0)),\"\")","v":"Ima-B Tot"},{"$f":"IFERROR(INDEX(Anual!$C$4:$C$65,MATCH('Lâmina Cart. Hip. Cons. Mod. Ag'!X61,Anual!F$4:F$65,0)),\"\")","v":"Ibrx Brasil"},{"$f":"IFERROR(INDEX(Anual!$C$4:$C$65,MATCH('Lâmina Cart. Hip. Cons. Mod. Ag'!Y61,Anual!G$4:G$65,0)),\"\")","v":"Ima-B Tot"},{"$f":"IFERROR(INDEX(Anual!$C$4:$C$65,MATCH('Lâmina Cart. Hip. Cons. Mod. Ag'!Z61,Anual!H$4:H$65,0)),\"\")","v":"Ibrx Brasil"},{"$f":"IFERROR(INDEX(Anual!$C$4:$C$65,MATCH('Lâmina Cart. Hip. Cons. Mod. Ag'!AA61,Anual!I$4:I$65,0)),\"\")","v":"Ibrx Brasil"},{"$f":"IFERROR(INDEX(Anual!$C$4:$C$65,MATCH('Lâmina Cart. Hip. Cons. Mod. Ag'!AB61,Anual!J$4:J$65,0)),\"\")","v":"Ind RF-M Tot"},{"$f":"IFERROR(INDEX(Anual!$C$4:$C$65,MATCH('Lâmina Cart. Hip. Cons. Mod. Ag'!AC61,Anual!K$4:K$65,0)),\"\")","v":"Bdrx"},{"$f":"IFERROR(INDEX(Anual!$C$4:$C$65,MATCH('Lâmina Cart. Hip. Cons. Mod. Ag'!AD61,Anual!L$4:L$65,0)),\"\")","v":"Small Cap"},{"$f":"IFERROR(INDEX(Anual!$C$4:$C$65,MATCH('Lâmina Cart. Hip. Cons. Mod. Ag'!AE61,Anual!M$4:M$65,0)),\"\")","v":"Ima-B Tot"}]
[null,"PoupAcumul Nova",null,null,null,"",null,"",null,null,null,null,null,null,null,null,null,null,null,null,{"$f":"IF(Anual!D12=\"\",\"\",U61+1)","v":9},{"$f":"IFERROR(LARGE(Anual!D$4:D$65,'Lâmina Cart. Hip. Cons. Mod. Ag'!$U$63),\"\")","v":1.0025011375E-2},{"$f":"IFERROR(LARGE(Anual!E$4:E$65,'Lâmina Cart. Hip. Cons. Mod. Ag'!$U$63),\"\")","v":0.15496332568999999},{"$f":"IFERROR(LARGE(Anual!F$4:F$65,'Lâmina Cart. Hip. Cons. Mod. Ag'!$U$63),\"\")","v":2.2226262928999999E-2},{"$f":"IFERROR(LARGE(Anual!G$4:G$65,'Lâmina Cart. Hip. Cons. Mod. Ag'!$U$63),\"\")","v":-1.9922432239999999E-2},{"$f":"IFERROR(LARGE(Anual!H$4:H$65,'Lâmina Cart. Hip. Cons. Mod. Ag'!$U$63),\"\")","v":2.7578158110999999E-2},{"$f":"IFERROR(LARGE(Anual!I$4:I$65,'Lâmina Cart. Hip. Cons. Mod. Ag'!$U$63),\"\")","v":0.28924692853},{"$f":"IFERROR(LARGE(Anual!J$4:J$65,'Lâmina Cart. Hip. Cons. Mod. Ag'!$U$63),\"\")","v":0.10543184353},{"$f":"IFERROR(LARGE(Anual!K$4:K$65,'Lâmina Cart. Hip. Cons. Mod. Ag'!$U$63),\"\")","v":0.23086458787},{"$f":"IFERROR(LARGE(Anual!L$4:L$65,'Lâmina Cart. Hip. Cons. Mod. Ag'!$U$63),\"\")","v":0.24810603514999999},{"$f":"IFERROR(LARGE(Anual!M$4:M$65,'Lâmina Cart. Hip. Cons. Mod. Ag'!$U$63),\"\")","v":7.1250372007999996E-2}]
[null,"SMLL",null,null,null,"",null,"",null,null,null,null,null,null,null,null,null,null,null,null,null,{"$f":"IFERROR(INDEX(Anual!$C$4:$C$65,MATCH('Lâmina Cart. Hip. Cons. Mod. Ag'!V63,Anual!D$4:D$65,0)),\"\")","v":"Ima-B Tot"},{"$f":"IFERROR(INDEX(Anual!$C$4:$C$65,MATCH('Lâmina Cart. Hip. Cons. Mod. Ag'!W63,Anual!E$4:E$65,0)),\"\")","v":"Ind Fdo Imob"},{"$f":"IFERROR(INDEX(Anual!$C$4:$C$65,MATCH('Lâmina Cart. Hip. Cons. Mod. Ag'!X63,Anual!F$4:F$65,0)),\"\")","v":"Ind Fdo Imob"},{"$f":"IFERROR(INDEX(Anual!$C$4:$C$65,MATCH('Lâmina Cart. Hip. Cons. Mod. Ag'!Y63,Anual!G$4:G$65,0)),\"\")","v":"Ind RF-M Tot"},{"$f":"IFERROR(INDEX(Anual!$C$4:$C$65,MATCH('Lâmina Cart. Hip. Cons. Mod. Ag'!Z63,Anual!H$4:H$65,0)),\"\")","v":"CDI"},{"$f":"IFERROR(INDEX(Anual!$C$4:$C$65,MATCH('Lâmina Cart. Hip. Cons. Mod. Ag'!AA63,Anual!I$4:I$65,0)),\"\")","v":"AGRESSIVA"},{"$f":"IFERROR(INDEX(Anual!$C$4:$C$65,MATCH('Lâmina Cart. Hip. Cons. Mod. Ag'!AB63,Anual!J$4:J$65,0)),\"\")","v":"AGRESSIVA"},{"$f":"IFERROR(INDEX(Anual!$C$4:$C$65,MATCH('Lâmina Cart. Hip. Cons. Mod. Ag'!AC63,Anual!K$4:K$65,0)),\"\")","v":"BR Malls Par"},{"$f":"IFERROR(INDEX(Anual!$C$4:$C$65,MATCH('Lâmina Cart. Hip. Cons. Mod. Ag'!AD63,Anual!L$4:L$65,0)),\"\")","v":"Ima-B Tot"},{"$f":"IFERROR(INDEX(Anual!$C$4:$C$65,MATCH('Lâmina Cart. Hip. Cons. Mod. Ag'!AE63,Anual!M$4:M$65,0)),\"\")","v":"Ind RF-M Tot"}]
[null,"UTIL",null,null,null,"",null,"",null,null,null,null,null,null,null,null,null,null,null,null,{"$f":"IF(Anual!D13=\"\",\"\",U63+1)","v":10},{"$f":"IFERROR(LARGE(Anual!D$4:D$65,'Lâmina Cart. Hip. Cons. Mod. Ag'!$U$65),\"\")","v":-2.3856762782000001E-3},{"$f":"IFERROR(LARGE(Anual!E$4:E$65,'Lâmina Cart. Hip. Cons. Mod. Ag'!$U$65),\"\")","v":0.14736156619999999},{"$f":"IFERROR(LARGE(Anual!F$4:F$65,'Lâmina Cart. Hip. Cons. Mod. Ag'!$U$65),\"\")","v":4.4710416314000002E-3},{"$f":"IFERROR(LARGE(Anual!G$4:G$65,'Lâmina Cart. Hip. Cons. Mod. Ag'!$U$65),\"\")","v":-2.2772328971999999E-2},{"$f":"IFERROR(LARGE(Anual!H$4:H$65,'Lâmina Cart. Hip. Cons. Mod. Ag'!$U$65),\"\")","v":2.4653843995000001E-2},{"$f":"IFERROR(LARGE(Anual!I$4:I$65,'Lâmina Cart. Hip. Cons. Mod. Ag'!$U$65),\"\")","v":0.24579669156},{"$f":"IFERROR(LARGE(Anual!J$4:J$65,'Lâmina Cart. Hip. Cons. Mod. Ag'!$U$65),\"\")","v":0.10032509214},{"$f":"IFERROR(LARGE(Anual!K$4:K$65,'Lâmina Cart. Hip. Cons. Mod. Ag'!$U$65),\"\")","v":0.21253403144999999},{"$f":"IFERROR(LARGE(Anual!L$4:L$65,'Lâmina Cart. Hip. Cons. Mod. Ag'!$U$65),\"\")","v":0.23371325078999999},{"$f":"IFERROR(LARGE(Anual!M$4:M$65,'Lâmina Cart. Hip. Cons. Mod. Ag'!$U$65),\"\")","v":5.5756295522000003E-2}]
[null,null,null,null,null,"",null,"",null,null,null,null,null,null,null,null,null,null,null,null,null,{"$f":"IFERROR(INDEX(Anual!$C$4:$C$65,MATCH('Lâmina Cart. Hip. Cons. Mod. Ag'!V65,Anual!D$4:D$65,0)),\"\")","v":"Ind Fdo Imob"},{"$f":"IFERROR(INDEX(Anual!$C$4:$C$65,MATCH('Lâmina Cart. Hip. Cons. Mod. Ag'!W65,Anual!E$4:E$65,0)),\"\")","v":"AGRESSIVA"},{"$f":"IFERROR(INDEX(Anual!$C$4:$C$65,MATCH('Lâmina Cart. Hip. Cons. Mod. Ag'!X65,Anual!F$4:F$65,0)),\"\")","v":"BR Malls Par"},{"$f":"IFERROR(INDEX(Anual!$C$4:$C$65,MATCH('Lâmina Cart. Hip. Cons. Mod. Ag'!Y65,Anual!G$4:G$65,0)),\"\")","v":"Ind Fdo Imob"},{"$f":"IFERROR(INDEX(Anual!$C$4:$C$65,MATCH('Lâmina Cart. Hip. Cons. Mod. Ag'!Z65,Anual!H$4:H$65,0)),\"\")","v":"Fama Fc FIA"},{"$f":"IFERROR(INDEX(Anual!$C$4:$C$65,MATCH('Lâmina Cart. Hip. Cons. Mod. Ag'!AA65,Anual!I$4:I$65,0)),\"\")","v":"Ambev S/A"},{"$f":"IFERROR(INDEX(Anual!$C$4:$C$65,MATCH('Lâmina Cart. Hip. Cons. Mod. Ag'!AB65,Anual!J$4:J$65,0)),\"\")","v":"Fama Fc FIA"},{"$f":"IFERROR(INDEX(Anual!$C$4:$C$65,MATCH('Lâmina Cart. Hip. Cons. Mod. Ag'!AC65,Anual!K$4:K$65,0)),\"\")","v":"AGRESSIVA"},{"$f":"IFERROR(INDEX(Anual!$C$4:$C$65,MATCH('Lâmina Cart. Hip. Cons. Mod. Ag'!AD65,Anual!L$4:L$65,0)),\"\")","v":"Ind RF-M Tot"},{"$f":"IFERROR(INDEX(Anual!$C$4:$C$65,MATCH('Lâmina Cart. Hip. Cons. Mod. Ag'!AE65,Anual!M$4:M$65,0)),\"\")","v":"AGRESSIVA"}]
[null,null,null,null,null,"",null,"",null,null,null,null,null,null,null,null,null,null,null,null,{"$f":"IF(Anual!D14=\"\",\"\",U65+1)","v":11},{"$f":"IFERROR(LARGE(Anual!D$4:D$65,'Lâmina Cart. Hip. Cons. Mod. Ag'!$U$67),\"\")","v":-9.9437338995000003E-3},{"$f":"IFERROR(LARGE(Anual!E$4:E$65,'Lâmina Cart. Hip. Cons. Mod. Ag'!$U$67),\"\")","v":0.14199379884999999},{"$f":"IFERROR(LARGE(Anual!F$4:F$65,'Lâmina Cart. Hip. Cons. Mod. Ag'!$U$67),\"\")","v":-8.7512531927000006E-3},{"$f":"IFERROR(LARGE(Anual!G$4:G$65,'Lâmina Cart. Hip. Cons. Mod. Ag'!$U$67),\"\")","v":-2.7265083908000001E-2},{"$f":"IFERROR(LARGE(Anual!H$4:H$65,'Lâmina Cart. Hip. Cons. Mod. Ag'!$U$67),\"\")","v":2.1441512312000002E-2},{"$f":"IFERROR(LARGE(Anual!I$4:I$65,'Lâmina Cart. Hip. Cons. Mod. Ag'!$U$67),\"\")","v":0.22950364609000001},{"$f":"IFERROR(LARGE(Anual!J$4:J$65,'Lâmina Cart. Hip. Cons. Mod. Ag'!$U$67),\"\")","v":9.6232303953000004E-2},{"$f":"IFERROR(LARGE(Anual!K$4:K$65,'Lâmina Cart. Hip. Cons. Mod. Ag'!$U$67),\"\")","v":0.19445278969999999},{"$f":"IFERROR(LARGE(Anual!L$4:L$65,'Lâmina Cart. Hip. Cons. Mod. Ag'!$U$67),\"\")","v":0.18111015751000001},{"$f":"IFERROR(LARGE(Anual!M$4:M$65,'Lâmina Cart. Hip. Cons. Mod. Ag'!$U$67),\"\")","v":5.4640718562999999E-2}]
[null,null,null,null,null,"",null,"",null,null,null,null,null,null,null,null,null,null,null,null,null,{"$f":"IFERROR(INDEX(Anual!$C$4:$C$65,MATCH('Lâmina Cart. Hip. Cons. Mod. Ag'!V67,Anual!D$4:D$65,0)),\"\")","v":"Ibrx Brasil"},{"$f":"IFERROR(INDEX(Anual!$C$4:$C$65,MATCH('Lâmina Cart. Hip. Cons. Mod. Ag'!W67,Anual!E$4:E$65,0)),\"\")","v":"MODERADA"},{"$f":"IFERROR(INDEX(Anual!$C$4:$C$65,MATCH('Lâmina Cart. Hip. Cons. Mod. Ag'!X67,Anual!F$4:F$65,0)),\"\")","v":"Ambev S/A"},{"$f":"IFERROR(INDEX(Anual!$C$4:$C$65,MATCH('Lâmina Cart. Hip. Cons. Mod. Ag'!Y67,Anual!G$4:G$65,0)),\"\")","v":"AGRESSIVA"},{"$f":"IFERROR(INDEX(Anual!$C$4:$C$65,MATCH('Lâmina Cart. Hip. Cons. Mod. Ag'!Z67,Anual!H$4:H$65,0)),\"\")","v":"Ida DI"},{"$f":"IFERROR(INDEX(Anual!$C$4:$C$65,MATCH('Lâmina Cart. Hip. Cons. Mod. Ag'!AA67,Anual!I$4:I$65,0)),\"\")","v":"Ima-B Tot"},{"$f":"IFERROR(INDEX(Anual!$C$4:$C$65,MATCH('Lâmina Cart. Hip. Cons. Mod. Ag'!AB67,Anual!J$4:J$65,0)),\"\")","v":"MODERADA"},{"$f":"IFERROR(INDEX(Anual!$C$4:$C$65,MATCH('Lâmina Cart. Hip. Cons. Mod. Ag'!AC67,Anual!K$4:K$65,0)),\"\")","v":"Ind Fdo Imob"},{"$f":"IFERROR(INDEX(Anual!$C$4:$C$65,MATCH('Lâmina Cart. Hip. Cons. Mod. Ag'!AD67,Anual!L$4:L$65,0)),\"\")","v":"AGRESSIVA"},{"$f":"IFERROR(INDEX(Anual!$C$4:$C$65,MATCH('Lâmina Cart. Hip. Cons. Mod. Ag'!AE67,Anual!M$4:M$65,0)),\"\")","v":"Ind Fdo Imob"}]
[null,null,null,null,null,"",null,"",null,null,null,null,null,null,null,null,null,null,null,null,{"$f":"IF(Anual!D15=\"\",\"\",U67+1)","v":12},{"$f":"IFERROR(LARGE(Anual!D$4:D$65,'Lâmina Cart. Hip. Cons. Mod. Ag'!$U$69),\"\")","v":-7.0648215587000004E-2},{"$f":"IFERROR(LARGE(Anual!E$4:E$65,'Lâmina Cart. Hip. Cons. Mod. Ag'!$U$69),\"\")","v":0.13039474929},{"$f":"IFERROR(LARGE(Anual!F$4:F$65,'Lâmina Cart. Hip. Cons. Mod. Ag'!$U$69),\"\")","v":-2.5398281176000001E-2},{"$f":"IFERROR(LARGE(Anual!G$4:G$65,'Lâmina Cart. Hip. Cons. Mod. Ag'!$U$69),\"\")","v":-0.11174726291000001},{"$f":"IFERROR(LARGE(Anual!H$4:H$65,'Lâmina Cart. Hip. Cons. Mod. Ag'!$U$69),\"\")","v":1.8668313733E-2},{"$f":"IFERROR(LARGE(Anual!I$4:I$65,'Lâmina Cart. Hip. Cons. Mod. Ag'!$U$69),\"\")","v":0.18869368026},{"$f":"IFERROR(LARGE(Anual!J$4:J$65,'Lâmina Cart. Hip. Cons. Mod. Ag'!$U$69),\"\")","v":8.1870778998999999E-2},{"$f":"IFERROR(LARGE(Anual!K$4:K$65,'Lâmina Cart. Hip. Cons. Mod. Ag'!$U$69),\"\")","v":0.15198352550999999},{"$f":"IFERROR(LARGE(Anual!L$4:L$65,'Lâmina Cart. Hip. Cons. Mod. Ag'!$U$69),\"\")","v":0.17092830111999999},{"$f":"IFERROR(LARGE(Anual!M$4:M$65,'Lâmina Cart. Hip. Cons. Mod. Ag'!$U$69),\"\")","v":-6.5508996067999994E-2}]
[null,null,null,null,null,null,null,null,null,null,null,null,null,null,null,null,null,null,null,null,null,{"$f":"IFERROR(INDEX(Anual!$C$4:$C$65,MATCH('Lâmina Cart. Hip. Cons. Mod. Ag'!V69,Anual!D$4:D$65,0)),\"\")","v":"Ambev S/A"},{"$f":"IFERROR(INDEX(Anual!$C$4:$C$65,MATCH('Lâmina Cart. Hip. Cons. Mod. Ag'!W69,Anual!E$4:E$65,0)),\"\")","v":"CDI"},{"$f":"IFERROR(INDEX(Anual!$C$4:$C$65,MATCH('Lâmina Cart. Hip. Cons. Mod. Ag'!X69,Anual!F$4:F$65,0)),\"\")","v":"AGRESSIVA"},{"$f":"IFERROR(INDEX(Anual!$C$4:$C$65,MATCH('Lâmina Cart. Hip. Cons. Mod. Ag'!Y69,Anual!G$4:G$65,0)),\"\")","v":"Ibrx Brasil"},{"$f":"IFERROR(INDEX(Anual!$C$4:$C$65,MATCH('Lâmina Cart. Hip. Cons. Mod. Ag'!Z69,Anual!H$4:H$65,0)),\"\")","v":"Brasil Capital Fc FIA"},{"$f":"IFERROR(INDEX(Anual!$C$4:$C$65,MATCH('Lâmina Cart. Hip. Cons. Mod. Ag'!AA69,Anual!I$4:I$65,0)),\"\")","v":"Bradesco"},{"$f":"IFERROR(INDEX(Anual!$C$4:$C$65,MATCH('Lâmina Cart. Hip. Cons. Mod. Ag'!AB69,Anual!J$4:J$65,0)),\"\")","v":"CONSERVADORA"},{"$f":"IFERROR(INDEX(Anual!$C$4:$C$65,MATCH('Lâmina Cart. Hip. Cons. Mod. Ag'!AC69,Anual!K$4:K$65,0)),\"\")","v":"Ind RF-M Tot"},{"$f":"IFERROR(INDEX(Anual!$C$4:$C$65,MATCH('Lâmina Cart. Hip. Cons. Mod. Ag'!AD69,Anual!L$4:L$65,0)),\"\")","v":"MODERADA"},{"$f":"IFERROR(INDEX(Anual!$C$4:$C$65,MATCH('Lâmina Cart. Hip. Cons. Mod. Ag'!AE69,Anual!M$4:M$65,0)),\"\")","v":"Brasil Capital Fc FIA"}]
[null,null,null,null,null,null,null,null,null,null,null,null,null,null,null,null,null,null,null,null,{"$f":"IF(Anual!D16=\"\",\"\",U69+1)","v":13},{"$f":"IFERROR(LARGE(Anual!D$4:D$65,'Lâmina Cart. Hip. Cons. Mod. Ag'!$U$71),\"\")","v":-9.4392958671999996E-2},{"$f":"IFERROR(LARGE(Anual!E$4:E$65,'Lâmina Cart. Hip. Cons. Mod. Ag'!$U$71),\"\")","v":0.12838967484},{"$f":"IFERROR(LARGE(Anual!F$4:F$65,'Lâmina Cart. Hip. Cons. Mod. Ag'!$U$71),\"\")","v":-5.2637814838999999E-2},{"$f":"IFERROR(LARGE(Anual!G$4:G$65,'Lâmina Cart. Hip. Cons. Mod. Ag'!$U$71),\"\")","v":-0.16060606060999999},{"$f":"IFERROR(LARGE(Anual!H$4:H$65,'Lâmina Cart. Hip. Cons. Mod. Ag'!$U$71),\"\")","v":-6.5400197809000003E-3},{"$f":"IFERROR(LARGE(Anual!I$4:I$65,'Lâmina Cart. Hip. Cons. Mod. Ag'!$U$71),\"\")","v":0.16881408894},{"$f":"IFERROR(LARGE(Anual!J$4:J$65,'Lâmina Cart. Hip. Cons. Mod. Ag'!$U$71),\"\")","v":8.1290679961999998E-2},{"$f":"IFERROR(LARGE(Anual!K$4:K$65,'Lâmina Cart. Hip. Cons. Mod. Ag'!$U$71),\"\")","v":0.14955420829999999},{"$f":"IFERROR(LARGE(Anual!L$4:L$65,'Lâmina Cart. Hip. Cons. Mod. Ag'!$U$71),\"\")","v":0.15751134674},{"$f":"IFERROR(LARGE(Anual!M$4:M$65,'Lâmina Cart. Hip. Cons. Mod. Ag'!$U$71),\"\")","v":-0.1240942904}]
[null,null,null,null,null,null,null,null,null,null,null,null,null,null,null,null,null,null,null,null,null,{"$f":"IFERROR(INDEX(Anual!$C$4:$C$65,MATCH('Lâmina Cart. Hip. Cons. Mod. Ag'!V71,Anual!D$4:D$65,0)),\"\")","v":"Brasil Capital Fc FIA"},{"$f":"IFERROR(INDEX(Anual!$C$4:$C$65,MATCH('Lâmina Cart. Hip. Cons. Mod. Ag'!W71,Anual!E$4:E$65,0)),\"\")","v":"CONSERVADORA"},{"$f":"IFERROR(INDEX(Anual!$C$4:$C$65,MATCH('Lâmina Cart. Hip. Cons. Mod. Ag'!X71,Anual!F$4:F$65,0)),\"\")","v":"Brasil Capital Fc FIA"},{"$f":"IFERROR(INDEX(Anual!$C$4:$C$65,MATCH('Lâmina Cart. Hip. Cons. Mod. Ag'!Y71,Anual!G$4:G$65,0)),\"\")","v":"BR Malls Par"},{"$f":"IFERROR(INDEX(Anual!$C$4:$C$65,MATCH('Lâmina Cart. Hip. Cons. Mod. Ag'!Z71,Anual!H$4:H$65,0)),\"\")","v":"Small Cap"},{"$f":"IFERROR(INDEX(Anual!$C$4:$C$65,MATCH('Lâmina Cart. Hip. Cons. Mod. Ag'!AA71,Anual!I$4:I$65,0)),\"\")","v":"MODERADA"},{"$f":"IFERROR(INDEX(Anual!$C$4:$C$65,MATCH('Lâmina Cart. Hip. Cons. Mod. Ag'!AB71,Anual!J$4:J$65,0)),\"\")","v":"Small Cap"},{"$f":"IFERROR(INDEX(Anual!$C$4:$C$65,MATCH('Lâmina Cart. Hip. Cons. Mod. Ag'!AC71,Anual!K$4:K$65,0)),\"\")","v":"MODERADA"},{"$f":"IFERROR(INDEX(Anual!$C$4:$C$65,MATCH('Lâmina Cart. Hip. Cons. Mod. Ag'!AD71,Anual!L$4:L$65,0)),\"\")","v":"Ida DI"},{"$f":"IFERROR(INDEX(Anual!$C$4:$C$65,MATCH('Lâmina Cart. Hip. Cons. Mod. Ag'!AE71,Anual!M$4:M$65,0)),\"\")","v":"Ibrx Brasil"}]
[null,null,null,null,null,null,null,null,null,null,null,null,null,null,null,null,null,null,null,null,{"$f":"IF(Anual!D17=\"\",\"\",U71+1)","v":""},{"$f":"IFERROR(LARGE(Anual!D$4:D$65,'Lâmina Cart. Hip. Cons. Mod. Ag'!$U$73),\"\")","v":""},{"$f":"IFERROR(LARGE(Anual!E$4:E$65,'Lâmina Cart. Hip. Cons. Mod. Ag'!$U$73),\"\")","v":""},{"$f":"IFERROR(LARGE(Anual!F$4:F$65,'Lâmina Cart. Hip. Cons. Mod. Ag'!$U$73),\"\")","v":""},{"$f":"IFERROR(LARGE(Anual!G$4:G$65,'Lâmina Cart. Hip. Cons. Mod. Ag'!$U$73),\"\")","v":""},{"$f":"IFERROR(LARGE(Anual!H$4:H$65,'Lâmina Cart. Hip. Cons. Mod. Ag'!$U$73),\"\")","v":""},{"$f":"IFERROR(LARGE(Anual!I$4:I$65,'Lâmina Cart. Hip. Cons. Mod. Ag'!$U$73),\"\")","v":""},{"$f":"IFERROR(LARGE(Anual!J$4:J$65,'Lâmina Cart. Hip. Cons. Mod. Ag'!$U$73),\"\")","v":""},{"$f":"IFERROR(LARGE(Anual!K$4:K$65,'Lâmina Cart. Hip. Cons. Mod. Ag'!$U$73),\"\")","v":""},{"$f":"IFERROR(LARGE(Anual!L$4:L$65,'Lâmina Cart. Hip. Cons. Mod. Ag'!$U$73),\"\")","v":""},{"$f":"IFERROR(LARGE(Anual!M$4:M$65,'Lâmina Cart. Hip. Cons. Mod. Ag'!$U$73),\"\")","v":""}]
[null,null,null,null,null,null,null,null,null,null,null,null,null,null,null,null,null,null,null,null,null,{"$f":"IFERROR(INDEX(Anual!$C$4:$C$65,MATCH('Lâmina Cart. Hip. Cons. Mod. Ag'!V73,Anual!D$4:D$65,0)),\"\")","v":""},{"$f":"IFERROR(INDEX(Anual!$C$4:$C$65,MATCH('Lâmina Cart. Hip. Cons. Mod. Ag'!W73,Anual!E$4:E$65,0)),\"\")","v":""},{"$f":"IFERROR(INDEX(Anual!$C$4:$C$65,MATCH('Lâmina Cart. Hip. Cons. Mod. Ag'!X73,Anual!F$4:F$65,0)),\"\")","v":""},{"$f":"IFERROR(INDEX(Anual!$C$4:$C$65,MATCH('Lâmina Cart. Hip. Cons. Mod. Ag'!Y73,Anual!G$4:G$65,0)),\"\")","v":""},{"$f":"IFERROR(INDEX(Anual!$C$4:$C$65,MATCH('Lâmina Cart. Hip. Cons. Mod. Ag'!Z73,Anual!H$4:H$65,0)),\"\")","v":""},{"$f":"IFERROR(INDEX(Anual!$C$4:$C$65,MATCH('Lâmina Cart. Hip. Cons. Mod. Ag'!AA73,Anual!I$4:I$65,0)),\"\")","v":""},{"$f":"IFERROR(INDEX(Anual!$C$4:$C$65,MATCH('Lâmina Cart. Hip. Cons. Mod. Ag'!AB73,Anual!J$4:J$65,0)),\"\")","v":""},{"$f":"IFERROR(INDEX(Anual!$C$4:$C$65,MATCH('Lâmina Cart. Hip. Cons. Mod. Ag'!AC73,Anual!K$4:K$65,0)),\"\")","v":""},{"$f":"IFERROR(INDEX(Anual!$C$4:$C$65,MATCH('Lâmina Cart. Hip. Cons. Mod. Ag'!AD73,Anual!L$4:L$65,0)),\"\")","v":""},{"$f":"IFERROR(INDEX(Anual!$C$4:$C$65,MATCH('Lâmina Cart. Hip. Cons. Mod. Ag'!AE73,Anual!M$4:M$65,0)),\"\")","v":""}]
[null,null,null,null,null,null,null,null,null,null,null,null,null,null,null,null,null,null,null,null,{"$f":"IF(Anual!D18=\"\",\"\",U73+1)","v":{"$error":"#VALUE!"}},{"$f":"IFERROR(LARGE(Anual!D$4:D$65,'Lâmina Cart. Hip. Cons. Mod. Ag'!$U$75),\"\")","v":""},{"$f":"IFERROR(LARGE(Anual!E$4:E$65,'Lâmina Cart. Hip. Cons. Mod. Ag'!$U$75),\"\")","v":""},{"$f":"IFERROR(LARGE(Anual!F$4:F$65,'Lâmina Cart. Hip. Cons. Mod. Ag'!$U$75),\"\")","v":""},{"$f":"IFERROR(LARGE(Anual!G$4:G$65,'Lâmina Cart. Hip. Cons. Mod. Ag'!$U$75),\"\")","v":""},{"$f":"IFERROR(LARGE(Anual!H$4:H$65,'Lâmina Cart. Hip. Cons. Mod. Ag'!$U$75),\"\")","v":""},{"$f":"IFERROR(LARGE(Anual!I$4:I$65,'Lâmina Cart. Hip. Cons. Mod. Ag'!$U$75),\"\")","v":""},{"$f":"IFERROR(LARGE(Anual!J$4:J$65,'Lâmina Cart. Hip. Cons. Mod. Ag'!$U$75),\"\")","v":""},{"$f":"IFERROR(LARGE(Anual!K$4:K$65,'Lâmina Cart. Hip. Cons. Mod. Ag'!$U$75),\"\")","v":""},{"$f":"IFERROR(LARGE(Anual!L$4:L$65,'Lâmina Cart. Hip. Cons. Mod. Ag'!$U$75),\"\")","v":""},{"$f":"IFERROR(LARGE(Anual!M$4:M$65,'Lâmina Cart. Hip. Cons. Mod. Ag'!$U$75),\"\")","v":""}]
[null,null,null,null,null,null,null,null,null,null,null,null,null,null,null,null,null,null,null,null,null,{"$f":"IFERROR(INDEX(Anual!$C$4:$C$65,MATCH('Lâmina Cart. Hip. Cons. Mod. Ag'!V75,Anual!D$4:D$65,0)),\"\")","v":""},{"$f":"IFERROR(INDEX(Anual!$C$4:$C$65,MATCH('Lâmina Cart. Hip. Cons. Mod. Ag'!W75,Anual!E$4:E$65,0)),\"\")","v":""},{"$f":"IFERROR(INDEX(Anual!$C$4:$C$65,MATCH('Lâmina Cart. Hip. Cons. Mod. Ag'!X75,Anual!F$4:F$65,0)),\"\")","v":""},{"$f":"IFERROR(INDEX(Anual!$C$4:$C$65,MATCH('Lâmina Cart. Hip. Cons. Mod. Ag'!Y75,Anual!G$4:G$65,0)),\"\")","v":""},{"$f":"IFERROR(INDEX(Anual!$C$4:$C$65,MATCH('Lâmina Cart. Hip. Cons. Mod. Ag'!Z75,Anual!H$4:H$65,0)),\"\")","v":""},{"$f":"IFERROR(INDEX(Anual!$C$4:$C$65,MATCH('Lâmina Cart. Hip. Cons. Mod. Ag'!AA75,Anual!I$4:I$65,0)),\"\")","v":""},{"$f":"IFERROR(INDEX(Anual!$C$4:$C$65,MATCH('Lâmina Cart. Hip. Cons. Mod. Ag'!AB75,Anual!J$4:J$65,0)),\"\")","v":""},{"$f":"IFERROR(INDEX(Anual!$C$4:$C$65,MATCH('Lâmina Cart. Hip. Cons. Mod. Ag'!AC75,Anual!K$4:K$65,0)),\"\")","v":""},{"$f":"IFERROR(INDEX(Anual!$C$4:$C$65,MATCH('Lâmina Cart. Hip. Cons. Mod. Ag'!AD75,Anual!L$4:L$65,0)),\"\")","v":""},{"$f":"IFERROR(INDEX(Anual!$C$4:$C$65,MATCH('Lâmina Cart. Hip. Cons. Mod. Ag'!AE75,Anual!M$4:M$65,0)),\"\")","v":""}]
[null,null,null,null,null,null,null,null,null,null,null,null,null,null,null,null,null,null,null,null,{"$f":"IF(Anual!D19=\"\",\"\",U75+1)","v":{"$error":"#VALUE!"}},{"$f":"IFERROR(LARGE(Anual!D$4:D$65,'Lâmina Cart. Hip. Cons. Mod. Ag'!$U$77),\"\")","v":""},{"$f":"IFERROR(LARGE(Anual!E$4:E$65,'Lâmina Cart. Hip. Cons. Mod. Ag'!$U$77),\"\")","v":""},{"$f":"IFERROR(LARGE(Anual!F$4:F$65,'Lâmina Cart. Hip. Cons. Mod. Ag'!$U$77),\"\")","v":""},{"$f":"IFERROR(LARGE(Anual!G$4:G$65,'Lâmina Cart. Hip. Cons. Mod. Ag'!$U$77),\"\")","v":""},{"$f":"IFERROR(LARGE(Anual!H$4:H$65,'Lâmina Cart. Hip. Cons. Mod. Ag'!$U$77),\"\")","v":""},{"$f":"IFERROR(LARGE(Anual!I$4:I$65,'Lâmina Cart. Hip. Cons. Mod. Ag'!$U$77),\"\")","v":""},{"$f":"IFERROR(LARGE(Anual!J$4:J$65,'Lâmina Cart. Hip. Cons. Mod. Ag'!$U$77),\"\")","v":""},{"$f":"IFERROR(LARGE(Anual!K$4:K$65,'Lâmina Cart. Hip. Cons. Mod. Ag'!$U$77),\"\")","v":""},{"$f":"IFERROR(LARGE(Anual!L$4:L$65,'Lâmina Cart. Hip. Cons. Mod. Ag'!$U$77),\"\")","v":""},{"$f":"IFERROR(LARGE(Anual!M$4:M$65,'Lâmina Cart. Hip. Cons. Mod. Ag'!$U$77),\"\")","v":""}]
[null,null,null,null,null,null,null,null,null,null,null,null,null,null,null,null,null,null,null,null,null,{"$f":"IFERROR(INDEX(Anual!$C$4:$C$65,MATCH('Lâmina Cart. Hip. Cons. Mod. Ag'!V77,Anual!D$4:D$65,0)),\"\")","v":""},{"$f":"IFERROR(INDEX(Anual!$C$4:$C$65,MATCH('Lâmina Cart. Hip. Cons. Mod. Ag'!W77,Anual!E$4:E$65,0)),\"\")","v":""},{"$f":"IFERROR(INDEX(Anual!$C$4:$C$65,MATCH('Lâmina Cart. Hip. Cons. Mod. Ag'!X77,Anual!F$4:F$65,0)),\"\")","v":""},{"$f":"IFERROR(INDEX(Anual!$C$4:$C$65,MATCH('Lâmina Cart. Hip. Cons. Mod. Ag'!Y77,Anual!G$4:G$65,0)),\"\")","v":""},{"$f":"IFERROR(INDEX(Anual!$C$4:$C$65,MATCH('Lâmina Cart. Hip. Cons. Mod. Ag'!Z77,Anual!H$4:H$65,0)),\"\")","v":""},{"$f":"IFERROR(INDEX(Anual!$C$4:$C$65,MATCH('Lâmina Cart. Hip. Cons. Mod. Ag'!AA77,Anual!I$4:I$65,0)),\"\")","v":""},{"$f":"IFERROR(INDEX(Anual!$C$4:$C$65,MATCH('Lâmina Cart. Hip. Cons. Mod. Ag'!AB77,Anual!J$4:J$65,0)),\"\")","v":""},{"$f":"IFERROR(INDEX(Anual!$C$4:$C$65,MATCH('Lâmina Cart. Hip. Cons. Mod. Ag'!AC77,Anual!K$4:K$65,0)),\"\")","v":""},{"$f":"IFERROR(INDEX(Anual!$C$4:$C$65,MATCH('Lâmina Cart. Hip. Cons. Mod. Ag'!AD77,Anual!L$4:L$65,0)),\"\")","v":""},{"$f":"IFERROR(INDEX(Anual!$C$4:$C$65,MATCH('Lâmina Cart. Hip. Cons. Mod. Ag'!AE77,Anual!M$4:M$65,0)),\"\")","v":""}]
[null,null,null,null,null,null,null,null,null,null,null,null,null,null,null,null,null,null,null,null,{"$f":"IF(Anual!D20=\"\",\"\",U77+1)","v":{"$error":"#VALUE!"}},{"$f":"IFERROR(LARGE(Anual!D$4:D$65,'Lâmina Cart. Hip. Cons. Mod. Ag'!$U$79),\"\")","v":""},{"$f":"IFERROR(LARGE(Anual!E$4:E$65,'Lâmina Cart. Hip. Cons. Mod. Ag'!$U$79),\"\")","v":""},{"$f":"IFERROR(LARGE(Anual!F$4:F$65,'Lâmina Cart. Hip. Cons. Mod. Ag'!$U$79),\"\")","v":""},{"$f":"IFERROR(LARGE(Anual!G$4:G$65,'Lâmina Cart. Hip. Cons. Mod. Ag'!$U$79),\"\")","v":""},{"$f":"IFERROR(LARGE(Anual!H$4:H$65,'Lâmina Cart. Hip. Cons. Mod. Ag'!$U$79),\"\")","v":""},{"$f":"IFERROR(LARGE(Anual!I$4:I$65,'Lâmina Cart. Hip. Cons. Mod. Ag'!$U$79),\"\")","v":""},{"$f":"IFERROR(LARGE(Anual!J$4:J$65,'Lâmina Cart. Hip. Cons. Mod. Ag'!$U$79),\"\")","v":""},{"$f":"IFERROR(LARGE(Anual!K$4:K$65,'Lâmina Cart. Hip. Cons. Mod. Ag'!$U$79),\"\")","v":""},{"$f":"IFERROR(LARGE(Anual!L$4:L$65,'Lâmina Cart. Hip. Cons. Mod. Ag'!$U$79),\"\")","v":""},{"$f":"IFERROR(LARGE(Anual!M$4:M$65,'Lâmina Cart. Hip. Cons. Mod. Ag'!$U$79),\"\")","v":""}]
[null,null,null,null,null,null,null,null,null,null,null,null,null,null,null,null,null,null,null,null,null,{"$f":"IFERROR(INDEX(Anual!$C$4:$C$65,MATCH('Lâmina Cart. Hip. Cons. Mod. Ag'!V79,Anual!D$4:D$65,0)),\"\")","v":""},{"$f":"IFERROR(INDEX(Anual!$C$4:$C$65,MATCH('Lâmina Cart. Hip. Cons. Mod. Ag'!W79,Anual!E$4:E$65,0)),\"\")","v":""},{"$f":"IFERROR(INDEX(Anual!$C$4:$C$65,MATCH('Lâmina Cart. Hip. Cons. Mod. Ag'!X79,Anual!F$4:F$65,0)),\"\")","v":""},{"$f":"IFERROR(INDEX(Anual!$C$4:$C$65,MATCH('Lâmina Cart. Hip. Cons. Mod. Ag'!Y79,Anual!G$4:G$65,0)),\"\")","v":""},{"$f":"IFERROR(INDEX(Anual!$C$4:$C$65,MATCH('Lâmina Cart. Hip. Cons. Mod. Ag'!Z79,Anual!H$4:H$65,0)),\"\")","v":""},{"$f":"IFERROR(INDEX(Anual!$C$4:$C$65,MATCH('Lâmina Cart. Hip. Cons. Mod. Ag'!AA79,Anual!I$4:I$65,0)),\"\")","v":""},{"$f":"IFERROR(INDEX(Anual!$C$4:$C$65,MATCH('Lâmina Cart. Hip. Cons. Mod. Ag'!AB79,Anual!J$4:J$65,0)),\"\")","v":""},{"$f":"IFERROR(INDEX(Anual!$C$4:$C$65,MATCH('Lâmina Cart. Hip. Cons. Mod. Ag'!AC79,Anual!K$4:K$65,0)),\"\")","v":""},{"$f":"IFERROR(INDEX(Anual!$C$4:$C$65,MATCH('Lâmina Cart. Hip. Cons. Mod. Ag'!AD79,Anual!L$4:L$65,0)),\"\")","v":""},{"$f":"IFERROR(INDEX(Anual!$C$4:$C$65,MATCH('Lâmina Cart. Hip. Cons. Mod. Ag'!AE79,Anual!M$4:M$65,0)),\"\")","v":""}]
[null,null,null,null,null,null,null,null,null,null,null,null,null,null,null,null,null,null,null,null,{"$f":"IF(Anual!D21=\"\",\"\",U79+1)","v":{"$error":"#VALUE!"}},{"$f":"IFERROR(LARGE(Anual!D$4:D$65,'Lâmina Cart. Hip. Cons. Mod. Ag'!$U$81),\"\")","v":""},{"$f":"IFERROR(LARGE(Anual!E$4:E$65,'Lâmina Cart. Hip. Cons. Mod. Ag'!$U$81),\"\")","v":""},{"$f":"IFERROR(LARGE(Anual!F$4:F$65,'Lâmina Cart. Hip. Cons. Mod. Ag'!$U$81),\"\")","v":""},{"$f":"IFERROR(LARGE(Anual!G$4:G$65,'Lâmina Cart. Hip. Cons. Mod. Ag'!$U$81),\"\")","v":""},{"$f":"IFERROR(LARGE(Anual!H$4:H$65,'Lâmina Cart. Hip. Cons. Mod. Ag'!$U$81),\"\")","v":""},{"$f":"IFERROR(LARGE(Anual!I$4:I$65,'Lâmina Cart. Hip. Cons. Mod. Ag'!$U$81),\"\")","v":""},{"$f":"IFERROR(LARGE(Anual!J$4:J$65,'Lâmina Cart. Hip. Cons. Mod. Ag'!$U$81),\"\")","v":""},{"$f":"IFERROR(LARGE(Anual!K$4:K$65,'Lâmina Cart. Hip. Cons. Mod. Ag'!$U$81),\"\")","v":""},{"$f":"IFERROR(LARGE(Anual!L$4:L$65,'Lâmina Cart. Hip. Cons. Mod. Ag'!$U$81),\"\")","v":""},{"$f":"IFERROR(LARGE(Anual!M$4:M$65,'Lâmina Cart. Hip. Cons. Mod. Ag'!$U$81),\"\")","v":""}]
[null,null,null,null,null,null,null,null,null,null,null,null,null,null,null,null,null,null,null,null,null,{"$f":"IFERROR(INDEX(Anual!$C$4:$C$65,MATCH('Lâmina Cart. Hip. Cons. Mod. Ag'!V81,Anual!D$4:D$65,0)),\"\")","v":""},{"$f":"IFERROR(INDEX(Anual!$C$4:$C$65,MATCH('Lâmina Cart. Hip. Cons. Mod. Ag'!W81,Anual!E$4:E$65,0)),\"\")","v":""},{"$f":"IFERROR(INDEX(Anual!$C$4:$C$65,MATCH('Lâmina Cart. Hip. Cons. Mod. Ag'!X81,Anual!F$4:F$65,0)),\"\")","v":""},{"$f":"IFERROR(INDEX(Anual!$C$4:$C$65,MATCH('Lâmina Cart. Hip. Cons. Mod. Ag'!Y81,Anual!G$4:G$65,0)),\"\")","v":""},{"$f":"IFERROR(INDEX(Anual!$C$4:$C$65,MATCH('Lâmina Cart. Hip. Cons. Mod. Ag'!Z81,Anual!H$4:H$65,0)),\"\")","v":""},{"$f":"IFERROR(INDEX(Anual!$C$4:$C$65,MATCH('Lâmina Cart. Hip. Cons. Mod. Ag'!AA81,Anual!I$4:I$65,0)),\"\")","v":""},{"$f":"IFERROR(INDEX(Anual!$C$4:$C$65,MATCH('Lâmina Cart. Hip. Cons. Mod. Ag'!AB81,Anual!J$4:J$65,0)),\"\")","v":""},{"$f":"IFERROR(INDEX(Anual!$C$4:$C$65,MATCH('Lâmina Cart. Hip. Cons. Mod. Ag'!AC81,Anual!K$4:K$65,0)),\"\")","v":""},{"$f":"IFERROR(INDEX(Anual!$C$4:$C$65,MATCH('Lâmina Cart. Hip. Cons. Mod. Ag'!AD81,Anual!L$4:L$65,0)),\"\")","v":""},{"$f":"IFERROR(INDEX(Anual!$C$4:$C$65,MATCH('Lâmina Cart. Hip. Cons. Mod. Ag'!AE81,Anual!M$4:M$65,0)),\"\")","v":""}]
[null,null,null,null,null,null,null,null,null,null,null,null,null,null,null,null,null,null,null,null,{"$f":"IF(Anual!D22=\"\",\"\",U81+1)","v":""},{"$f":"IFERROR(LARGE(Anual!D$4:D$65,'Lâmina Cart. Hip. Cons. Mod. Ag'!$U$83),\"\")","v":""},{"$f":"IFERROR(LARGE(Anual!E$4:E$65,'Lâmina Cart. Hip. Cons. Mod. Ag'!$U$83),\"\")","v":""},{"$f":"IFERROR(LARGE(Anual!F$4:F$65,'Lâmina Cart. Hip. Cons. Mod. Ag'!$U$83),\"\")","v":""},{"$f":"IFERROR(LARGE(Anual!G$4:G$65,'Lâmina Cart. Hip. Cons. Mod. Ag'!$U$83),\"\")","v":""},{"$f":"IFERROR(LARGE(Anual!H$4:H$65,'Lâmina Cart. Hip. Cons. Mod. Ag'!$U$83),\"\")","v":""},{"$f":"IFERROR(LARGE(Anual!I$4:I$65,'Lâmina Cart. Hip. Cons. Mod. Ag'!$U$83),\"\")","v":""},{"$f":"IFERROR(LARGE(Anual!J$4:J$65,'Lâmina Cart. Hip. Cons. Mod. Ag'!$U$83),\"\")","v":""},{"$f":"IFERROR(LARGE(Anual!K$4:K$65,'Lâmina Cart. Hip. Cons. Mod. Ag'!$U$83),\"\")","v":""},{"$f":"IFERROR(LARGE(Anual!L$4:L$65,'Lâmina Cart. Hip. Cons. Mod. Ag'!$U$83),\"\")","v":""},{"$f":"IFERROR(LARGE(Anual!M$4:M$65,'Lâmina Cart. Hip. Cons. Mod. Ag'!$U$83),\"\")","v":""}]
[null,null,null,null,null,null,null,null,null,null,null,null,null,null,null,null,null,null,null,null,null,{"$f":"IFERROR(INDEX(Anual!$C$4:$C$65,MATCH('Lâmina Cart. Hip. Cons. Mod. Ag'!V83,Anual!D$4:D$65,0)),\"\")","v":""},{"$f":"IFERROR(INDEX(Anual!$C$4:$C$65,MATCH('Lâmina Cart. Hip. Cons. Mod. Ag'!W83,Anual!E$4:E$65,0)),\"\")","v":""},{"$f":"IFERROR(INDEX(Anual!$C$4:$C$65,MATCH('Lâmina Cart. Hip. Cons. Mod. Ag'!X83,Anual!F$4:F$65,0)),\"\")","v":""},{"$f":"IFERROR(INDEX(Anual!$C$4:$C$65,MATCH('Lâmina Cart. Hip. Cons. Mod. Ag'!Y83,Anual!G$4:G$65,0)),\"\")","v":""},{"$f":"IFERROR(INDEX(Anual!$C$4:$C$65,MATCH('Lâmina Cart. Hip. Cons. Mod. Ag'!Z83,Anual!H$4:H$65,0)),\"\")","v":""},{"$f":"IFERROR(INDEX(Anual!$C$4:$C$65,MATCH('Lâmina Cart. Hip. Cons. Mod. Ag'!AA83,Anual!I$4:I$65,0)),\"\")","v":""},{"$f":"IFERROR(INDEX(Anual!$C$4:$C$65,MATCH('Lâmina Cart. Hip. Cons. Mod. Ag'!AB83,Anual!J$4:J$65,0)),\"\")","v":""},{"$f":"IFERROR(INDEX(Anual!$C$4:$C$65,MATCH('Lâmina Cart. Hip. Cons. Mod. Ag'!AC83,Anual!K$4:K$65,0)),\"\")","v":""},{"$f":"IFERROR(INDEX(Anual!$C$4:$C$65,MATCH('Lâmina Cart. Hip. Cons. Mod. Ag'!AD83,Anual!L$4:L$65,0)),\"\")","v":""},{"$f":"IFERROR(INDEX(Anual!$C$4:$C$65,MATCH('Lâmina Cart. Hip. Cons. Mod. Ag'!AE83,Anual!M$4:M$65,0)),\"\")","v":""}]
[null,null,null,null,null,null,null,null,null,null,null,null,null,null,null,null,null,null,null,null,{"$f":"IF(Anual!D23=\"\",\"\",U83+1)","v":""},{"$f":"IFERROR(LARGE(Anual!D$4:D$65,'Lâmina Cart. Hip. Cons. Mod. Ag'!$U$85),\"\")","v":""},{"$f":"IFERROR(LARGE(Anual!E$4:E$65,'Lâmina Cart. Hip. Cons. Mod. Ag'!$U$85),\"\")","v":""},{"$f":"IFERROR(LARGE(Anual!F$4:F$65,'Lâmina Cart. Hip. Cons. Mod. Ag'!$U$85),\"\")","v":""},{"$f":"IFERROR(LARGE(Anual!G$4:G$65,'Lâmina Cart. Hip. Cons. Mod. Ag'!$U$85),\"\")","v":""},{"$f":"IFERROR(LARGE(Anual!H$4:H$65,'Lâmina Cart. Hip. Cons. Mod. Ag'!$U$85),\"\")","v":""},{"$f":"IFERROR(LARGE(Anual!I$4:I$65,'Lâmina Cart. Hip. Cons. Mod. Ag'!$U$85),\"\")","v":""},{"$f":"IFERROR(LARGE(Anual!J$4:J$65,'Lâmina Cart. Hip. Cons. Mod. Ag'!$U$85),\"\")","v":""},{"$f":"IFERROR(LARGE(Anual!K$4:K$65,'Lâmina Cart. Hip. Cons. Mod. Ag'!$U$85),\"\")","v":""},{"$f":"IFERROR(LARGE(Anual!L$4:L$65,'Lâmina Cart. Hip. Cons. Mod. Ag'!$U$85),\"\")","v":""},{"$f":"IFERROR(LARGE(Anual!M$4:M$65,'Lâmina Cart. Hip. Cons. Mod. Ag'!$U$85),\"\")","v":""}]
[null,null,null,null,null,null,null,null,null,null,null,null,null,null,null,null,null,null,null,null,null,{"$f":"IFERROR(INDEX(Anual!$C$4:$C$65,MATCH('Lâmina Cart. Hip. Cons. Mod. Ag'!V85,Anual!D$4:D$65,0)),\"\")","v":""},{"$f":"IFERROR(INDEX(Anual!$C$4:$C$65,MATCH('Lâmina Cart. Hip. Cons. Mod. Ag'!W85,Anual!E$4:E$65,0)),\"\")","v":""},{"$f":"IFERROR(INDEX(Anual!$C$4:$C$65,MATCH('Lâmina Cart. Hip. Cons. Mod. Ag'!X85,Anual!F$4:F$65,0)),\"\")","v":""},{"$f":"IFERROR(INDEX(Anual!$C$4:$C$65,MATCH('Lâmina Cart. Hip. Cons. Mod. Ag'!Y85,Anual!G$4:G$65,0)),\"\")","v":""},{"$f":"IFERROR(INDEX(Anual!$C$4:$C$65,MATCH('Lâmina Cart. Hip. Cons. Mod. Ag'!Z85,Anual!H$4:H$65,0)),\"\")","v":""},{"$f":"IFERROR(INDEX(Anual!$C$4:$C$65,MATCH('Lâmina Cart. Hip. Cons. Mod. Ag'!AA85,Anual!I$4:I$65,0)),\"\")","v":""},{"$f":"IFERROR(INDEX(Anual!$C$4:$C$65,MATCH('Lâmina Cart. Hip. Cons. Mod. Ag'!AB85,Anual!J$4:J$65,0)),\"\")","v":""},{"$f":"IFERROR(INDEX(Anual!$C$4:$C$65,MATCH('Lâmina Cart. Hip. Cons. Mod. Ag'!AC85,Anual!K$4:K$65,0)),\"\")","v":""},{"$f":"IFERROR(INDEX(Anual!$C$4:$C$65,MATCH('Lâmina Cart. Hip. Cons. Mod. Ag'!AD85,Anual!L$4:L$65,0)),\"\")","v":""},{"$f":"IFERROR(INDEX(Anual!$C$4:$C$65,MATCH('Lâmina Cart. Hip. Cons. Mod. Ag'!AE85,Anual!M$4:M$65,0)),\"\")","v":""}]
[null,null,null,null,null,null,null,null,null,null,null,null,null,null,null,null,null,null,null,null,{"$f":"IF(Anual!D24=\"\",\"\",U85+1)","v":""},{"$f":"IFERROR(LARGE(Anual!D$4:D$65,'Lâmina Cart. Hip. Cons. Mod. Ag'!$U$87),\"\")","v":""},{"$f":"IFERROR(LARGE(Anual!E$4:E$65,'Lâmina Cart. Hip. Cons. Mod. Ag'!$U$87),\"\")","v":""},{"$f":"IFERROR(LARGE(Anual!F$4:F$65,'Lâmina Cart. Hip. Cons. Mod. Ag'!$U$87),\"\")","v":""},{"$f":"IFERROR(LARGE(Anual!G$4:G$65,'Lâmina Cart. Hip. Cons. Mod. Ag'!$U$87),\"\")","v":""},{"$f":"IFERROR(LARGE(Anual!H$4:H$65,'Lâmina Cart. Hip. Cons. Mod. Ag'!$U$87),\"\")","v":""},{"$f":"IFERROR(LARGE(Anual!I$4:I$65,'Lâmina Cart. Hip. Cons. Mod. Ag'!$U$87),\"\")","v":""},{"$f":"IFERROR(LARGE(Anual!J$4:J$65,'Lâmina Cart. Hip. Cons. Mod. Ag'!$U$87),\"\")","v":""},{"$f":"IFERROR(LARGE(Anual!K$4:K$65,'Lâmina Cart. Hip. Cons. Mod. Ag'!$U$87),\"\")","v":""},{"$f":"IFERROR(LARGE(Anual!L$4:L$65,'Lâmina Cart. Hip. Cons. Mod. Ag'!$U$87),\"\")","v":""},{"$f":"IFERROR(LARGE(Anual!M$4:M$65,'Lâmina Cart. Hip. Cons. Mod. Ag'!$U$87),\"\")","v":""}]
[null,null,null,null,null,null,null,null,null,null,null,null,null,null,null,null,null,null,null,null,null,{"$f":"IFERROR(INDEX(Anual!$C$4:$C$65,MATCH('Lâmina Cart. Hip. Cons. Mod. Ag'!V87,Anual!D$4:D$65,0)),\"\")","v":""},{"$f":"IFERROR(INDEX(Anual!$C$4:$C$65,MATCH('Lâmina Cart. Hip. Cons. Mod. Ag'!W87,Anual!E$4:E$65,0)),\"\")","v":""},{"$f":"IFERROR(INDEX(Anual!$C$4:$C$65,MATCH('Lâmina Cart. Hip. Cons. Mod. Ag'!X87,Anual!F$4:F$65,0)),\"\")","v":""},{"$f":"IFERROR(INDEX(Anual!$C$4:$C$65,MATCH('Lâmina Cart. Hip. Cons. Mod. Ag'!Y87,Anual!G$4:G$65,0)),\"\")","v":""},{"$f":"IFERROR(INDEX(Anual!$C$4:$C$65,MATCH('Lâmina Cart. Hip. Cons. Mod. Ag'!Z87,Anual!H$4:H$65,0)),\"\")","v":""},{"$f":"IFERROR(INDEX(Anual!$C$4:$C$65,MATCH('Lâmina Cart. Hip. Cons. Mod. Ag'!AA87,Anual!I$4:I$65,0)),\"\")","v":""},{"$f":"IFERROR(INDEX(Anual!$C$4:$C$65,MATCH('Lâmina Cart. Hip. Cons. Mod. Ag'!AB87,Anual!J$4:J$65,0)),\"\")","v":""},{"$f":"IFERROR(INDEX(Anual!$C$4:$C$65,MATCH('Lâmina Cart. Hip. Cons. Mod. Ag'!AC87,Anual!K$4:K$65,0)),\"\")","v":""},{"$f":"IFERROR(INDEX(Anual!$C$4:$C$65,MATCH('Lâmina Cart. Hip. Cons. Mod. Ag'!AD87,Anual!L$4:L$65,0)),\"\")","v":""},{"$f":"IFERROR(INDEX(Anual!$C$4:$C$65,MATCH('Lâmina Cart. Hip. Cons. Mod. Ag'!AE87,Anual!M$4:M$65,0)),\"\")","v":""}]

{"sheet":"Historico","index":1,"n_rows":1056,"n_cols":9,"rows_kept":1056,"cut":false,"hidden":false,"merged":[[4,1,6,1]]}
[null,null,null,null,null,"Planilha Auxiliar Não Modificar - Exceto Na Criação de Benchmark"]
[null,"Data Final",{"$f":"'Lâmina Cart. Hip. Cons. Mod. Ag'!$E$2","v":"2024-09-24"},"← Não Modificar"]
[null,"Data Inicial",{"$f":"'Lâmina Cart. Hip. Cons. Mod. Ag'!$P$6","v":"48M"},"← Não Modificar"]
[null,"Intervalo","D","← Não Modificar",null,"Mínimo:",{"$f":"ROUNDDOWN(MIN(C$13:G$15002),-1)","v":90},null,"← Não Modificar"]
[null,"Ativos",{"$f":"'Lâmina Cart. Hip. Cons. Mod. Ag'!$E$8","v":"Conservador                                                                                                     <EcoPortfolio>{\"type\":\"P\",\"tolerance\":null,\"rebalance\":\"NO\",\"name\":\"Conservador\",\"data\":[[null,\"2024-09-24\"],[\"CDI Acumulado\",40.0],[\"IDA DI\",25.0],[\"IRF-M\",15.0],[\"IMA-B\",5.0],[\"IBXX\",0.0],[\"SMLL<xbsp>\",5.0],[\"BDRX\",0.0],[\"IFIX\",5.0],[\"DOLOF\",5.0],[\"ABEV3<XBSP>\",null],[\"BRML3<XBSP>\",null],[\"BBDC4<XBSP>\",null],[\"024813\",null],[\"267163\",null],[\"219436\",null],[\"\",null],[\"\",null],[\"\",null],[\"\",null],[\"\",null],[\"\",null],[\"\",null],[\"\",null],[\"\",null],[\"\",null],[\"\",null],[\"\",null],[\"\",null],[\"\",null],[\"\",null],[\"\",null],[\"\",null],[\"\",null],[\"\",null],[\"\",null],[\"\",null],[\"\",null],[\"\",null],[\"\",null],[\"\",null],[\"\",null],[\"\",null],[\"\",null],[\"\",null],[\"\",null],[\"\",null],[\"\",null],[\"\",null],[\"\",null],[\"\",null],[\"\",null],[\"\",null],[\"\",null],[\"\",null],[\"\",null],[\"\",null],[\"\",null],[\"\",null],[\"\",null],[\"\",null]]}"},"← Não Modificar",null,"Máximo:",{"$f":"ROUNDUP(MAX(C$13:G$15002),-1)","v":150},null,"← Não Modificar"]
[null,null,{"$f":"'Lâmina Cart. Hip. Cons. Mod. Ag'!$G$8","v":"Moderada                                                                                                     <EcoPortfolio>{\"type\":\"P\",\"tolerance\":null,\"rebalance\":\"NO\",\"name\":\"Moderada\",\"data\":[[null,\"2024-09-24\"],[\"CDI Acumulado\",20.0],[\"IDA DI\",20.0],[\"IRF-M\",20.0],[\"IMA-B\",15.0],[\"IBXX\",5.0],[\"SMLL<xbsp>\",5.0],[\"BDRX\",5.0],[\"IFIX\",5.0],[\"DOLOF\",5.0],[\"ABEV3<XBSP>\",null],[\"BRML3<XBSP>\",null],[\"BBDC4<XBSP>\",null],[\"024813\",null],[\"267163\",null],[\"219436\",null],[\"\",null],[\"\",null],[\"\",null],[\"\",null],[\"\",null],[\"\",null],[\"\",null],[\"\",null],[\"\",null],[\"\",null],[\"\",null],[\"\",null],[\"\",null],[\"\",null],[\"\",null],[\"\",null],[\"\",null],[\"\",null],[\"\",null],[\"\",null],[\"\",null],[\"\",null],[\"\",null],[\"\",null],[\"\",null],[\"\",null],[\"\",null],[\"\",null],[\"\",null],[\"\",null],[\"\",null],[\"\",null],[\"\",null],[\"\",null],[\"\",null],[\"\",null],[\"\",null],[\"\",null],[\"\",null],[\"\",null],[\"\",null],[\"\",null],[\"\",null],[\"\",null]]}"},"← Não Modificar",null,"VBA Gráfico:",{"$f":"AtualizarLimitesGrafico(\"Lâmina\",\"Rentabilidade\",G4,G5)","v":{"$error":"#NAME?"}},null,"← Não Modificar"]
[null,null,{"$f":"'Lâmina Cart. Hip. Cons. Mod. Ag'!$I$8","v":"Agressiva                                                                                                     <EcoPortfolio>{\"type\":\"P\",\"tolerance\":null,\"rebalance\":\"NO\",\"name\":\"Agressiva\",\"data\":[[null,\"2024-09-24\"],[\"CDI Acumulado\",5.0],[\"IDA DI\",5.0],[\"IRF-M\",15.0],[\"IMA-B\",10.0],[\"IBXX\",15.0],[\"SMLL<xbsp>\",15.0],[\"BDRX\",10.0],[\"IFIX\",15.0],[\"DOLOF\",10.0],[\"ABEV3<XBSP>\",null],[\"BRML3<XBSP>\",null],[\"BBDC4<XBSP>\",null],[\"024813\",null],[\"267163\",null],[\"219436\",null],[\"\",null],[\"\",null],[\"\",null],[\"\",null],[\"\",null],[\"\",null],[\"\",null],[\"\",null],[\"\",null],[\"\",null],[\"\",null],[\"\",null],[\"\",null],[\"\",null],[\"\",null],[\"\",null],[\"\",null],[\"\",null],[\"\",null],[\"\",null],[\"\",null],[\"\",null],[\"\",null],[\"\",null],[\"\",null],[\"\",null],[\"\",null],[\"\",null],[\"\",null],[\"\",null],[\"\",null],[\"\",null],[\"\",null],[\"\",null],[\"\",null],[\"\",null],[\"\",null],[\"\",null],[\"\",null],[\"\",null],[\"\",null],[\"\",null],[\"\",null],[\"\",null]]}"},"← Não Modificar"]
[]
[null,null,null,null,null,"Escolha Índice","A","← Escolha um tipo de operação \"A\" (Adicionar um fator prefixado) ou \"M\" (Multiplica o fator)."]
[null,null,null,null,null,null,1,"← Digite o valor do Fator"]
[null,null,null,null,null,"CDI Acumulado",{"$f":"_xll.ECOBENCHMARK(F11,$G$9,$G$10,$G$12)","v":"CDI+1%a.a.                                                                                                    <EcoBenchmark>{\"ticker\":\"CDI Acumulado\",\"operation\":{\"type\":\"A\",\"value\":1.0},\"name\":\"CDI+1%a.a.\"}"},"← Não Modificar"]
[null,"Data","Conservadora","Moderada","Agressiva",{"$f":"_xll.ECONOMATICA($F$11,\"Name\")","v":"CDI"},{"$f":"F12&\"+\"&G10&\"%a.a.\"","v":"CDI+1%a.a."}]
[null,{"$f":"_xll.ECONOMATICA($C$5,\"close\",,$C$2,$C$3,$C$4,,,\"true\",\"false\",,{\"def.defdef=7\"})","v":"2020-09-24"},100,{"$f":"_xll.ECONOMATICA(C6,\"close\",,$C$2,$C$3,$C$4,,,\"false\",\"false\",,{\"def.defdef=7\"})","v":100},{"$f":"_xll.ECONOMATICA(C7,\"close\",,$C$2,$C$3,$C$4,,,\"false\",\"false\",,{\"def.defdef=7\"})","v":100},{"$f":"_xll.ECONOMATICA(F11,\"close\",,$C$2,$C$3,$C$4,,,\"false\",\"false\",,{\"def.defdef=7\"})","v":100},{"$f":"_xll.ECONOMATICA(G11,\"close\",,$C$2,$C$3,$C$4,,,\"false\",\"false\",,{\"def.defdef=7\"})","v":100}]
[null,"2020-09-25",99.965151507000002,100.05208908,100.08990975,100.00746916,100.01141807]
[null,"2020-09-28",99.629145280000003,99.554038646999999,99.297418614999998,100.01493898,100.02283756]
[null,"2020-09-29",99.605013482999993,99.468453375999999,98.991730387999993,100.02240929,100.03425828]
[null,"2020-09-30",99.794886919999996,99.834087905999993,99.641906005999999,100.02988027000001,100.04568041]
[null,"2020-10-01",99.964186068999993,100.08002616,100.28552766,100.03735173,100.05710378000001]
[null,"2020-10-02",99.775232047000003,99.669888779000004,99.625413562000006,100.04482369999999,100.06852839]
[null,"2020-10-05",99.926942693000001,99.970231622,100.14545205,100.05229632,100.07995440000001]
[null,"2020-10-06",99.728719986000002,99.671280827000004,99.664422944999998,100.05976943,100.09138165]
[null,"2020-10-07",99.813843860000006,99.836781805000001,99.924425937999999,100.06724319999999,100.10281031]
[null,"2020-10-08",100.05070816999999,100.24609374000001,100.79992534,100.07471747,100.11424021000001]
[null,"2020-10-09",100.00696363,100.21620464,100.67578267,100.08219223,100.12567135]
[null,"2020-10-12"]
[null,"2020-10-13",100.11122165,100.51526007,101.20349179999999,100.08966765,100.1371039]
[null,"2020-10-14",100.20313183,100.64324383,101.51608628,100.09714356000001,100.14853769]
[null,"2020-10-15",100.23530302,100.59467786,101.57331506,100.10461997,100.15997272]
[null,"2020-10-16",100.19663628000001,100.53803430000001,101.41112962,100.11209703999999,100.17140915]
[null,"2020-10-19",100.27222905000001,100.57063001,101.36031570999999,100.11957460000001,100.18284683]
[null,"2020-10-20",100.43596167,100.93927992,102.10200353,100.12705281,100.19428591]
[null,"2020-10-21",100.49549155,100.9592171,102.17924642,100.13453153,100.20572623]
[null,"2020-10-22",100.4479455,100.94966565,102.29442082,100.14201073,100.2171678]
[null,"2020-10-23",100.39754032,100.85655623,102.18935284,100.14949059999999,100.22861077]
[null,"2020-10-26",100.33512139,100.70827029,101.78693733,100.15697096,100.24005498]
[null,"2020-10-27",100.26269575000001,100.61698268000001,101.52848041999999,100.16445198,100.2515006]
[null,"2020-10-28",99.898796071000007,99.961009649000005,99.736525076999996,100.17193349,100.26294747]
[null,"2020-10-29",100.05986932,100.25778674999999,100.35536449,100.17941549,100.27439557]
[null,"2020-10-30",99.813422291999998,99.721973765000001,99.111219448,100.18689816,100.28584508]
[null,"2020-11-02"]
[null,"2020-11-03",99.784484657999997,99.867948510999994,99.607917289,100.19438132000001,100.29729584]
[null,"2020-11-04",100.08747052,100.39358579,100.74609799,100.20186514,100.30874799999999]
[null,"2020-11-05",100.24948319000001,100.74087419,101.61707704,100.20934945,100.3202014]
[null,"2020-11-06",100.43747582,100.91382321,101.89073956999999,100.21683425000001,100.33165605000001]
[null,"2020-11-09",100.37600676,101.02514965,102.23496639,100.22431972,100.3431121]
[null,"2020-11-10",100.40782758,101.02997139999999,102.34176454999999,100.23180567,100.3545694]
[null,"2020-11-11",100.3066189,100.89814818000001,102.15925812,100.23929228999999,100.36602809999999]
[null,"2020-11-12",100.10764863,100.55866958999999,101.32965804,100.24677939999999,100.37748805]
[null,"2020-11-13",100.51327068000001,101.14842611,102.65108005,100.25426701000001,100.38894924]
[null,"2020-11-16",100.55452409,101.28040237,103.02552681,100.26175526999999,100.40041184]
[null,"2020-11-17",100.59611653,101.30006706,103.08453096,100.26924403,100.41187567999999]
[null,"2020-11-18",100.40532517,101.01732269,102.59066633,100.27673344,100.42334092999999]
[null,"2020-11-19",100.50009128000001,101.11821304999999,102.82270015,100.28422335,100.43480743000001]
[null,"2020-11-20",100.44918829,101.01723536,102.70229885000001,100.29171375,100.44627517000001]
[null,"2020-11-23",100.55175500999999,101.20751446,103.24097104000001,100.29920482,100.45774431]
[null,"2020-11-24",100.74723274999999,101.57662079000001,104.05617128,100.30669637,100.46921469999999]
[null,"2020-11-25",100.82424378,101.67828609999999,104.2574855,100.31418859,100.4806865]
[null,"2020-11-26",100.91719261999999,101.8309678,104.49340899000001,100.32168129999999,100.49215955]
[null,"2020-11-27",101.00336858999999,102.01144331,104.78381056000001,100.32917449999999,100.50363384000001]
[null,"2020-11-30",100.88772262000001,101.79577854,104.13568169,100.33666836,100.51510953]
[null,"2020-12-01",101.10227258,102.18321478,104.86935587000001,100.34416272,100.52658648000001]
[null,"2020-12-02",101.1642312,102.32076693,105.06461657,100.35165773,100.53806483]
[null,"2020-12-03",101.33637784,102.57502902,105.37502753,100.35915324,100.54954442]
[null,"2020-12-04",101.37238574,102.66963783,105.62138849,100.36664924,100.56102525999999]
[null,"2020-12-07",101.27311118999999,102.55350072,105.37668763000001,100.37414591,100.57250752]
[null,"2020-12-08",101.26670978999999,102.59793861999999,105.38771878999999,100.38164306,100.58399101000001]
[null,"2020-12-09",101.19652924,102.47211693,105.03725869,100.38914087000001,100.59547592]
[null,"2020-12-10",101.30678923000001,102.64110762,105.39228725,100.39663917999999,100.60696206999999]
[null,"2020-12-11",101.39504347,102.81352552,105.60348491000001,100.40413798,100.61844945999999]
[null,"2020-12-14",101.34558214,102.76762228,105.48061455,100.41163744000001,100.62993827]
[null,"2020-12-15",101.53103471999999,103.08187961,106.09117607,100.4191374,100.64142832]
[null,"2020-12-16",101.59841801,103.24596213,106.57266282000001,100.42663801,100.65291979]
[null,"2020-12-17",101.53872819999999,103.21261857,106.50029254,100.43413912,100.6644125]
[null,"2020-12-18",101.5991994,103.27559088,106.55290804000001,100.44164072,100.67590645]
[null,"2020-12-21",101.53687976000001,103.1286485,106.04120433,100.44914298,100.68740182000001]
[null,"2020-12-22",101.52851461,103.18983615,106.12922632,100.45664573000001,100.69889843]
[null,"2020-12-23",101.81915438,103.61135308999999,107.01855639,100.46414914,100.71039645]
[null,"2020-12-24",101.83828898,103.63612510999999,107.04126613,100.47165305,100.72189572000001]
[null,"2020-12-25"]
[null,"2020-12-28",102.02315618999999,103.95619317000001,107.8165159,100.47915745,100.73339623]
[null,"2020-12-29",102.12303881,104.11898201,108.02910169,100.48666251,100.74489816000001]
[null,"2020-12-30",102.20182025,104.18217136,108.11495271,100.49416806000001,100.75640133]
[null,"2020-12-31",102.21358187,104.19967398999999,108.12435979,100.50167427,100.76790592]
[null,"2021-01-01"]
[null,"2021-01-04",102.10575468,104.1410229,107.93474775,100.50918098,100.77941174999999]
[null,"2021-01-05",102.23880518999999,104.30357022,108.29851046,100.51668818,100.79091883]
[null,"2021-01-06",101.98604102,104.01339767,107.70757488,100.52419604000001,100.80242732000001]
[null,"2021-01-07",101.92102782000001,104.21369455,108.42506978,100.53170439,100.81393706]
[null,"2021-01-08",102.21975860000001,104.65887359,109.61581228999999,100.53921339999999,100.82544821]
[null,"2021-01-11",102.17533636,104.48245681,109.33370617,100.54672291,100.83696061000001]
[null,"2021-01-12",102.38941767,104.64658621,109.61797987999999,100.5542329,100.84847425]
[null,"2021-01-13",102.11559647,104.23213394,108.88086733,100.56174356,100.85998931]
[null,"2021-01-14",102.33580938999999,104.49289711999999,109.46851589000001,100.56925471,100.87150561]
[null,"2021-01-15",102.18883348999999,104.19839705,108.68867772,100.57676652000001,100.88302333]
[null,"2021-01-18",102.20596064999999,104.2633065,108.81273745,100.58427883,100.8945423]
[null,"2021-01-19",102.15913195,104.2169154,108.70000529000001,100.59179163,100.90606251]
[null,"2021-01-20",102.11757824,104.14972281,108.48580764,100.59930507999999,100.91758414]
[null,"2021-01-21",101.96458242999999,103.96118052,108.0986387,100.60681903,100.92910701]
[null,"2021-01-22",101.91414901,103.8925459,107.91559509,100.61433364,100.94063130000001]
[null,"2021-01-25",102.02096211,103.99969548999999,108.09616763,100.62184875,100.95215684]
[null,"2021-01-26",101.82935784999999,103.73741687,107.36132155,100.62936434,100.96368362]
[null,"2021-01-27",101.87454818000001,103.70316398999999,107.20891191,100.6368806,100.97521182]
[null,"2021-01-28",102.32140233,104.38318576,108.74981042,100.64439735000001,100.98674127]
[null,"2021-01-29",102.22463396000001,104.08727922999999,107.69278231,100.65191476,100.99827213]
[null,"2021-02-01",102.41870437999999,104.46429694,108.70246585,100.65943265999999,101.00980423999999]
[null,"2021-02-02",102.59121694,104.71797724,109.15410432,100.66695122,101.02133777]
[null,"2021-02-03",102.66188882,104.91498573,109.61865982,100.67447027999999,101.03287254]
[null,"2021-02-04",102.6488954,104.92229657,109.64870860000001,100.68198983000001,101.04440857]
[null,"2021-02-05",102.72352646,105.03310737,109.96279908,100.68951004,101.05594600000001]
[null,"2021-02-08",102.75007848,105.04291111000001,110.00971337,100.69703074,101.06748469]
[null,"2021-02-09",102.71259885000001,104.97360691999999,109.87386008999999,100.7045521,101.07902479000001]
[null,"2021-02-10",102.54563688,104.77363481,109.20857767,100.71207395,101.09056614000001]
[null,"2021-02-11",102.58403531,104.84421634,109.41892274,100.71959630000001,101.10210875]
[null,"2021-02-12",102.59704927999999,104.87431629,109.50937073999999,100.72711931000001,101.11365275999999]
[null,"2021-02-15"]
[null,"2021-02-16"]
[null,"2021-02-17",102.64504644,104.96320297,109.84525751,100.73464281,101.12519803000001]
[null,"2021-02-18",102.59539208,104.87123698000001,109.51945483,100.74216697,101.13674471]
[null,"2021-02-19",102.58056585,104.73653487,109.35817685000001,100.74969161999999,101.14829263999999]
[null,"2021-02-22",102.35835342,104.14938277,107.98752761,100.75721677,101.15984182]
[null,"2021-02-23",102.40400471,104.31114186000001,108.43513367,100.76474258,101.17139242]
[null,"2021-02-24",102.39256204,104.28661889999999,108.60080676,100.77226888,101.18294426999999]
[null,"2021-02-25",102.1312628,103.76886627,107.37800635000001,100.77979584000001,101.19449753000001]
[null,"2021-02-26",102.03961949000001,103.59294005,106.86374292000001,100.78732329,101.20605205]
[null,"2021-03-01",101.97748138999999,103.62079969,106.98933045,100.7948514,101.21760798]
[null,"2021-03-02",102.03319916,103.6971289,107.23037997,100.80238000999999,101.22916515999999]
[null,"2021-03-03",102.02427757,103.57801406999999,106.96332574,100.80990911000001,101.24072359]
[null,"2021-03-04",102.13726468,103.83057338,107.19561251,100.81743887,101.25228344]
[null,"2021-03-05",102.56190866999999,104.59787532999999,108.63057556,100.82496912000001,101.26384453999999]
[null,"2021-03-08",102.02481376999999,103.78745391,106.74219741,100.83250003000001,101.27540706000001]
[null,"2021-03-09",102.09171164999999,103.93064459999999,107.11410097,100.84003144,101.28697083]
[null,"2021-03-10",102.14996764,103.97971235,107.3857344,100.84756333999999,101.29853584999999]
[null,"2021-03-11",102.27134728,104.21215629,108.10548321,100.85509589,101.31010229]
[null,"2021-03-12",102.23402809,104.07305636,107.92286539,100.86262895,101.32166998]
[null,"2021-03-15",102.40735969000001,104.35127645999999,108.5133998,100.87016266000001,101.33323908]
[null,"2021-03-16",102.27048053,104.19084749,108.02470590999999,100.87769686,101.34480944000001]
[null,"2021-03-17",102.58176158000001,104.62012116,109.08268643,100.88523171999999,101.35638121]
[null,"2021-03-18",102.16432709,103.98519199,107.65648244,100.89570304,101.37090403000001]
[null,"2021-03-19",102.29418724,104.02065661,108.18614169,100.90617551,101.38542898999999]
[null,"2021-03-22",102.20501645,103.8649861,107.87052088,100.91664913,101.3999561]
[null,"2021-03-23",102.03763846,103.53221085,107.2230217,100.92712374,101.4144852]
[null,"2021-03-24",101.87136463,103.33109712,106.76082916999999,100.93759951,101.42901643]
[null,"2021-03-25",102.22773307999999,103.80806536999999,107.74223428000001,100.94807625999999,101.44354966]
[null,"2021-03-26",102.2974607,104.06024814,108.19555922000001,100.95855416000001,101.45808503000001]
[null,"2021-03-29",102.33739151,104.15183569,108.40786565000001,100.96903322,101.47262254]
[null,"2021-03-30",102.67265725999999,104.57163521,109.3680839,100.97951326,101.48716204]
[null,"2021-03-31",102.62667,104.48952636999999,109.1410386,100.98999446000001,101.50170369]
[null,"2021-04-01",102.53255365,104.42119654,108.92059897,101.00047665,101.51624733]
[null,"2021-04-02"]
[null,"2021-04-05",102.66299653,104.72003857,109.72864194,101.01095998,101.53079311]
[null,"2021-04-06",102.72497468,104.69751027,109.83837966999999,101.02144448,101.54534104]
[null,"2021-04-07",102.62926462,104.63147671999999,109.78360785,101.03192995000001,101.55989095]
[null,"2021-04-08",102.86596446999999,104.97073168999999,110.28776648,101.04241659,101.57444302]
[null,"2021-04-09",102.92609907000001,105.03048475999999,110.54121662,101.0529042,101.58899706]
[null,"2021-04-12",103.01437414,105.22190103,110.95521314,101.06339298,101.60355326]
[null,"2021-04-13",103.02600056999999,105.22858841999999,111.10889256999999,101.0738829,101.61811161]
[null,"2021-04-14",103.06728355,105.27229059,111.14984773,101.08437381,101.63267193999999]
[null,"2021-04-15",103.09450228,105.38648678,111.32213170999999,101.09486588,101.64723442]
[null,"2021-04-16",103.28373809,105.63037472000001,111.69954847,101.10535892999999,101.66179889]
[null,"2021-04-19",103.22476532,105.51651561,111.36781445,101.11585314,101.67636551]
[null,"2021-04-20",103.06448774,105.21477213,110.85767186,101.12634850000001,101.69093427999999]
[null,"2021-04-21"]
[null,"2021-04-22",103.10240053,105.19937607,110.55155888,101.13684483999999,101.70550503]
[null,"2021-04-23",103.19373892,105.47660569,111.09510637,101.14734233999999,101.72007794]
[null,"2021-04-26",103.24705659,105.51848809000001,111.18384233,101.15784099,101.73465299]
[null,"2021-04-27",103.11717733,105.33067481,110.7152743,101.16834063,101.74923004]
[null,"2021-04-28",103.1300134,105.37205287,110.83423971000001,101.17884142,101.76380923000001]
[null,"2021-04-29",103.12189477,105.32587053,110.69814873999999,101.18934321,101.77839041]
[null,"2021-04-30",103.06129083,105.17996678999999,110.40546237,101.19984614000001,101.79297375]
[null,"2021-05-03",103.05951305000001,105.16392886,110.45807852,101.21035022,101.80755923]
[null,"2021-05-04",102.97910826,104.91054963000001,110.04477055,101.2208553,101.82214671]
[null,"2021-05-05",103.05950396999999,105.03683088,110.41321601999999,101.23136151999999,101.83673632999999]
[null,"2021-05-06",102.89366043,104.89184962,110.12794058,101.2447935,101.85427032]
[null,"2021-05-07",102.98215562,105.10054689,110.63995614,101.25822728999999,101.87180735]
[null,"2021-05-10",102.91734957,104.95203844,110.27068758999999,101.27166289,101.88934743]
[null,"2021-05-11",102.97872113,105.09603254,110.43419475,101.2851003,101.90689055999999]
[null,"2021-05-12",102.58598372,104.45203707,108.93874022999999,101.29853952000001,101.92443674]
[null,"2021-05-13",102.75147929000001,104.70176047,109.44143832,101.31198039,101.9419858]
[null,"2021-05-14",102.90962365999999,104.93476779,110.05263741,101.32542307,101.95953790999999]
[null,"2021-05-17",103.05350093,105.18074233999999,110.50409766999999,101.33886757000001,101.97709307]
[null,"2021-05-18",102.99916054000001,105.03756211,110.41271795,101.35231387,101.99465128]
[null,"2021-05-19",102.94766962999999,104.96653499999999,110.18085146,101.36576198,102.01221253999999]
[null,"2021-05-20",103.11674701,105.201176,110.57039792,101.37921191,102.02977686]
[null,"2021-05-21",103.08637929,105.21608701,110.47097635,101.39266348,102.04734405000001]
[null,"2021-05-24",103.19634795,105.41188219,111.0424891,101.40611686,102.0649143]
[null,"2021-05-25",103.26459428,105.41498061999999,110.9770185,101.41957205999999,102.08248759999999]
[null,"2021-05-26",103.40830671000001,105.63321135,111.43820049,101.43302907,102.10006396]
[null,"2021-05-27",103.57469205,105.82414192,111.78959574,101.44648788000001,102.11764336]
[null,"2021-05-28",103.60375516000001,105.91748380999999,111.94741688000001,101.45994851,102.13522582]
[null,"2021-05-31",103.65303285,106.01122368999999,112.25811871000001,101.47341095,102.15281133000001]
[null,"2021-06-01",103.68450061,106.08324976,112.48241588,101.48687504,102.17039973]
[null,"2021-06-02",103.78075319,106.26614694,112.80127657,101.50034094,102.18799118]
[null,"2021-06-03"]
[null,"2021-06-04",103.90779965999999,106.43930675,113.10074573999999,101.51380865,102.20558568]
[null,"2021-06-07",103.83618970000001,106.35867743999999,113.01050067,101.52727817,102.22318324]
[null,"2021-06-08",103.83904296999999,106.31333528,112.80545041000001,101.5407495,102.24078385]
[null,"2021-06-09",103.81907652,106.332449,112.84756427000001,101.55422264000001,102.25838752]
[null,"2021-06-10",103.89438761,106.39832431000001,113.13138882,101.5676976,102.27599424]
[null,"2021-06-11",103.82023074999999,106.31779371,112.92668,101.58117420000001,102.29360385]
[null,"2021-06-14",103.95001786,106.53302626999999,113.4247562,101.59465261,102.31121650999999]
[null,"2021-06-15",103.98327784,106.48505385999999,113.31009949,101.60813284,102.32883224]
[null,"2021-06-16",103.84836851,106.28177298999999,112.82100669,101.62161487,102.34645101]
[null,"2021-06-17",103.7268298,106.00390874999999,112.35576451,101.63801359999999,102.36700863999999]
[null,"2021-06-18",103.70945589,105.94826789,112.46652177999999,101.65441497,102.38757038]
[null,"2021-06-21",103.92150844,106.24304051999999,113.00705416,101.67081897,102.40813624]
[null,"2021-06-22",103.77873606,106.03575284,112.60667859,101.6872256,102.42870621]
[null,"2021-06-23",103.69153491,105.96742795,112.3880003,101.70363487,102.44928031000001]
[null,"2021-06-24",103.75025549,106.08721721000001,112.54455065000001,101.72004677,102.46985853]
[null,"2021-06-25",103.46019196,105.7281414,111.53909073,101.73646131,102.49044086000001]
[null,"2021-06-28",103.54947447000001,105.87055015,111.64670844,101.75287848000001,102.51102732]
[null,"2021-06-29",103.60419444,105.95124085,111.78625676,101.76929828999999,102.53161789000001]
[null,"2021-06-30",103.67184533,106.03242514999999,111.96047759,101.78572072999999,102.55221259]
[null,"2021-07-01",103.56449012,105.900572,111.58717742,101.80214597,102.57281157]
[null,"2021-07-02",103.81308445000001,106.34380575,112.55516733,101.81857385000001,102.59341467]
[null,"2021-07-05",103.83532293,106.3238954,112.49507753,101.83500436,102.6140219]
[null,"2021-07-06",103.70289158,106.19964242,112.06608326999999,101.8514375,102.63463324999999]
[null,"2021-07-07",103.92967556000001,106.58820544,112.81348859000001,101.86787328,102.65524872]
[null,"2021-07-08",103.80674337000001,106.34633633,112.19225249,101.88431169,102.67586832000001]
[null,"2021-07-09",103.80033319,106.34142722,112.15830459999999,101.90075274,102.69649203]
[null,"2021-07-12",104.02519722,106.63415525000001,113.06724489,101.91719643,102.71711987]
[null,"2021-07-13",104.06595023,106.69274789000001,113.32247264999999,101.93364274,102.73775184]
[null,"2021-07-14",104.10572082,106.72037611,113.27137027000001,101.95009186,102.7583881]
[null,"2021-07-15",104.08337194000001,106.68636176,113.07386617,101.96654361,102.77902847999999]
[null,"2021-07-16",104.05244666999999,106.55952259,112.59094525,101.98299799999999,102.79967299]
[null,"2021-07-19",104.05130874,106.52260457,112.28229829,101.99945502,102.82032162]
[null,"2021-07-20",104.26802072,106.88182854999999,112.97132222,102.01591467999999,102.84097438000001]
[null,"2021-07-21",104.28756224999999,106.92415333,113.06159782,102.03237697,102.86163127]
[null,"2021-07-22",104.29516577,106.98124224,113.19957429,102.04884189000001,102.88229228]
[null,"2021-07-23",104.08217461,106.69003879,112.67022934000001,102.06530945,102.90295742000001]
[null,"2021-07-26",104.06211437,106.66496281000001,112.69317208,102.08177981,102.92362686]
[null,"2021-07-27",103.80352993,106.21909377,111.69704485,102.0982528,102.94430042]
[null,"2021-07-28",103.87923164999999,106.35624165,112.10514809999999,102.11472843,102.96497811]
[null,"2021-07-29",103.81937292000001,106.24183995999999,111.78357250000001,102.13120669,102.98565994000001]
[null,"2021-07-30",103.55336369,105.74460173,110.67376847,102.14768759,103.00634589000001]
[null,"2021-08-02",103.63715926,105.82149939999999,110.88396089,102.16417112000001,103.02703597]
[null,"2021-08-03",103.7729116,106.10525312,111.37429012,102.18065729,103.04773018]
[null,"2021-08-04",103.60078065,105.84136472,110.68604931,102.19714625,103.06842869]
[null,"2021-08-05",103.31803592999999,105.47410533,110.10588152,102.21751372,103.09304039]
[null,"2021-08-06",103.5063485,105.74549033,110.65156573,102.2378853,103.11765801999999]
[null,"2021-08-09",103.55337360999999,105.73387663,110.76380684,102.25826099,103.14228159]
[null,"2021-08-10",103.45573518,105.58745118,110.3195776,102.27864064000001,103.16691093]
[null,"2021-08-11",103.35043281999999,105.47292643999999,110.04657812000001,102.29902441,103.19154621]
[null,"2021-08-12",103.17329035,105.20584759,109.45326405,102.31941229,103.21618742]
[null,"2021-08-13",103.15126436,105.11686788,109.47665915,102.33980412,103.24083441000001]
[null,"2021-08-16",102.75867194999999,104.61783389,108.23945098,102.36020007,103.26548733]
[null,"2021-08-17",102.61146508,104.36754577000001,107.4952284,102.38060014,103.2901462]
[null,"2021-08-18",102.61416287,104.23195788,107.41967733,102.40100416,103.31481084000001]
[null,"2021-08-19",102.98229847,104.66423632,108.22591084,102.42141229000001,103.33948141]
[null,"2021-08-20",103.2542748,105.04683467,108.9414476,102.44182455000001,103.36415793]
[null,"2021-08-23",103.15369483000001,104.9036029,108.77184647999999,102.46224091000001,103.38884039]
[null,"2021-08-24",103.43524831000001,105.32597078000001,109.69910596,102.48266124,103.41352863]
[null,"2021-08-25",103.53551225,105.49638090000001,109.87758988,102.50308567,103.43822281]
[null,"2021-08-26",103.33427270999999,105.20543775,109.05789353999999,102.52351423,103.46292293]
[null,"2021-08-27",103.54106222999999,105.54158128,109.80355362,102.54394673,103.48762883000001]
[null,"2021-08-30",103.44796431,105.42441718000001,109.47045742,102.56438335,103.51234067]
[null,"2021-08-31",103.23672698999999,105.06786437,108.79428496,102.58482409,103.53705846]
[null,"2021-09-01",103.26788444,105.16272480000001,108.93968674,102.60526895,103.5617822]
[null,"2021-09-02",103.03607981,104.73568994999999,107.98956303999999,102.62571776,103.58651171]
[null,"2021-09-03",102.93988969999999,104.64408385,107.76077042,102.64617068,103.61124717]
[null,"2021-09-06",103.09425521999999,104.85335918,108.23473306,102.66662771999999,103.63598858]
[null,"2021-09-07"]
[null,"2021-09-08",102.69737297,104.23308226,106.68499494,102.68708888,103.66073594]
[null,"2021-09-09",102.91309823,104.50148827,107.33413793,102.70755398999999,103.68548908]
[null,"2021-09-10",102.87548839,104.41459943,107.04590566,102.72802321,103.71024817]
[null,"2021-09-13",103.17163365,104.80992088000001,107.99883459,102.74849655,103.73501321000001]
[null,"2021-09-14",103.26700553000001,104.92176492999999,108.10059783,102.76897400999999,103.75978419]
[null,"2021-09-15",103.24725859,104.86769338000001,107.86710148,102.78945559,103.78456113]
[null,"2021-09-16",103.20805278,104.74937848,107.5587355,102.80994112,103.80934386]
[null,"2021-09-17",103.16496531999999,104.49272431999999,106.92824199,102.83043076,103.83413254]
[null,"2021-09-20",102.92765649,104.10725021,105.76937584,102.85092452000001,103.85892715999999]
[null,"2021-09-21",103.15996239,104.43428176,106.43371320999999,102.8714224,103.88372775000001]
[null,"2021-09-22",103.30306459000001,104.72278267999999,107.14405959,102.89192439,103.90853428]
[null,"2021-09-23",103.35401078,104.87152039999999,107.63836356,102.91629598999999,103.93725061000001]
[null,"2021-09-24",103.41761219999999,104.92035491999999,107.6840345,102.94067335,103.96597486]
[null,"2021-09-27",103.37760451,104.90351473,107.63138305,102.96505648,103.99470705]
[null,"2021-09-28",103.12812482,104.37546521,106.23205648,102.98944537,104.02344715]
[null,"2021-09-29",103.17768335,104.49212614,106.43394243,103.01384002,104.05219519000001]
[null,"2021-09-30",103.2106599,104.46098078999999,106.45244472,103.03824044,104.08095116]
[null,"2021-10-01",103.44096268,104.80496733,107.20982721999999,103.06264662,104.10971506]
[null,"2021-10-04",103.17065223,104.36138846,106.04743903000001,103.08705856,104.13848688]
[null,"2021-10-05",103.11793836,104.38457076,106.01740235,103.11147626,104.16726665]
[null,"2021-10-06",103.20928143,104.52802668,106.10800865,103.13589973000001,104.19605434]
[null,"2021-10-07",103.19301728000001,104.56178323,106.21923535000001,103.16032912999999,104.22485012999999]
[null,"2021-10-08",103.5636595,105.07879276,107.3606044,103.18476429,104.25365386]
[null,"2021-10-11",103.49622585,104.94777793999999,107.08610323000001,103.20920520999999,104.28246553]
[null,"2021-10-12"]
[null,"2021-10-13",103.77099896999999,105.27709188999999,107.86171797999999,103.2336519,104.31128513]
[null,"2021-10-14",103.70539816,105.24817401,107.80955157,103.25810435,104.34011266]
[null,"2021-10-15",103.73741601,105.29764222999999,108.15074795,103.28256256,104.36894814]
[null,"2021-10-18",103.86009462,105.46079086,108.51669291,103.30702669999999,104.39779172]
[null,"2021-10-19",103.3385985,104.75385004,106.98364915000001,103.33149661,104.42664324]
[null,"2021-10-20",103.30101204,104.64210076000001,106.77681246,103.35597227,104.4555027]
[null,"2021-10-21",102.88851012000001,104.07848611,105.56148646,103.3804537,104.48437010000001]
[null,"2021-10-22",102.72216469999999,103.77681375,104.80660503999999,103.4049409,104.51324544000001]
[null,"2021-10-25",102.74458514,103.80840797,105.29188859,103.42943402,104.54212889]
[null,"2021-10-26",102.31371778,103.22356997999999,103.95749616000001,103.4539329,104.57102029000001]
[null,"2021-10-27",102.38110139,103.30783293,104.01489986999999,103.47843755,104.59991963]
[null,"2021-10-28",102.05236565,102.85817120999999,103.42434692,103.50871153,104.63465318]
[null,"2021-10-29",102.09573834,102.9590053,103.04694058,103.53899441,104.6693983]
[null,"2021-11-01",102.30171717,103.25507167000001,103.96346351,103.56928601,104.70415482]
[null,"2021-11-02"]
[null,"2021-11-03",102.74357008,103.87742732,104.76942505,103.59958650999999,104.73892291999999]
[null,"2021-11-04",102.46643007,103.48687807,103.90218744000001,103.62989589,104.77370258000001]
[null,"2021-11-05",102.60065058000001,103.5889076,104.24795733000001,103.66021417,104.80849383]
[null,"2021-11-08",102.54675109999999,103.58579343,104.12657983,103.69054134,104.84329664000001]
[null,"2021-11-09",102.67631742,103.71595723999999,104.29040129000001,103.72087740000001,104.87811103]
[null,"2021-11-10",102.75391292,103.78488335,104.48412184,103.75122218999999,104.91293684]
[null,"2021-11-11",102.93723265,104.01049737,105.02464053,103.78157587,104.94777422]
[null,"2021-11-12",102.81644907,103.95372136,104.58034053,103.81193844000001,104.98262318]
[null,"2021-11-15"]
[null,"2021-11-16",102.56391861,103.61515943000001,103.63826392999999,103.8423099,105.01748372]
[null,"2021-11-17",102.40147257,103.3797512,102.99697854,103.87269026,105.05235585]
[null,"2021-11-18",102.47367371999999,103.47140026,103.12967636,103.90307951,105.08723955000001]
[null,"2021-11-19",102.62659582000001,103.73058148,103.55565568,103.93347765,105.12213484]
[null,"2021-11-22",102.40282496,103.39466928,102.84436739,103.96388468000001,105.15704172]
[null,"2021-11-23",102.5127744,103.59188113,103.09046083,103.9943006,105.19196019]
[null,"2021-11-24",102.51556017999999,103.69654629,103.22612646,104.02472542,105.22689024]
[null,"2021-11-25",102.65215379999999,103.89520259,103.7812338,104.05515913000001,105.26183188]
[null,"2021-11-26",102.4032728,103.36218517,102.24127674,104.08560172,105.29678512]
[null,"2021-11-29",102.53139595,103.65698802999999,102.72748287,104.11605322,105.33174993999999]
[null,"2021-11-30",102.51723425,103.55580328000001,102.29672349000001,104.14651376,105.36672652999999]
[null,"2021-12-01",102.31903741000001,103.26682273999999,101.57247321,104.1769832,105.40171470999999]
[null,"2021-12-02",102.62519567,103.79739125,102.73019542,104.20746153,105.43671448000001]
[null,"2021-12-03",103.02291,104.24183608,103.51573667,104.23794875999999,105.47172586000001]
[null,"2021-12-06",103.28953153,104.66934465999999,104.56045132,104.26844487,105.50674883000001]
[null,"2021-12-07",103.29862815,104.77442096,104.74177219000001,104.29894988,105.54178339000001]
[null,"2021-12-08",103.57644365,105.06550199,105.38009285,104.32946394,105.57682973]
[null,"2021-12-09",103.38720383,104.78698185,104.62272968000001,104.3657177,105.61768721999999]
[null,"2021-12-10",103.72738732000001,105.33527019,105.63999681999999,104.40198397,105.65856042999999]
[null,"2021-12-13",103.6776497,105.22920698999999,105.44528565,104.43826292999999,105.69944954]
[null,"2021-12-14",103.54747141,105.01848798,104.82549985,104.47455438999999,105.74035438999999]
[null,"2021-12-15",103.73993218,105.29859377,105.48471551,104.51085854,105.78127513]
[null,"2021-12-16",103.68187231,105.16919452,105.38601602,104.5471752,105.8222116]
[null,"2021-12-17",103.71081675000001,105.05745635,105.24142918,104.58350454000001,105.86316397]
[null,"2021-12-20",103.60610294,104.84963165000001,104.4369806,104.61984656,105.90413225]
[null,"2021-12-21",103.74650053000001,105.13747118000001,104.91279548,104.65620109,105.94511627]
[null,"2021-12-22",103.74201635999999,105.09943808,104.78178395,104.6925683,105.9861162]
[null,"2021-12-23",103.68101547000001,105.05555265,104.73180692,104.72894819,106.02713203]
[null,"2021-12-24",103.67284663,105.04403730999999,104.67275307,104.76534076,106.06816378000001]
[null,"2021-12-27",103.81273576,105.21440629,105.09804068,104.80174601,106.10921144]
[null,"2021-12-28",103.91901098,105.26187734,105.21395836000001,104.83816378,106.15027483999999]
[null,"2021-12-29",103.86248483,105.18400722,105.07805881,104.87459422000001,106.19135416]
[null,"2021-12-30",103.97156931000001,105.17907889,105.16269113,104.91103733999999,106.23244939999999]
[null,"2021-12-31",104.00374597,105.2095011,105.17634004999999,104.94749314000001,106.27356056000001]
[null,"2022-01-03",103.78669698,105.07191403,104.68134735,104.98396162,106.31468764]
[null,"2022-01-04",103.5804704,104.79730148,104.10964017000001,105.02044278,106.35583063999999]
[null,"2022-01-05",103.16966493,104.11766873000001,102.47804207999999,105.05693662,106.39698957]
[null,"2022-01-06",103.19303642,104.09252049,102.44625332,105.09344314000001,106.43816442000001]
[null,"2022-01-07",103.19174965000001,104.0541197,102.53274863,105.12996234000001,106.4793552]
[null,"2022-01-10",103.07098275,103.88113819,102.09168219999999,105.16649421,106.5205619]
[null,"2022-01-11",103.19061447,104.03666215,102.63304100000001,105.20303877000001,106.56178454]
[null,"2022-01-12",103.44092055,104.42568,103.42381422,105.23959600000001,106.60302312]
[null,"2022-01-13",103.36839159,104.27240195,103.02423146,105.27616592,106.64427762]
[null,"2022-01-14",103.50498312000001,104.49013081,103.51788559000001,105.31274868,106.68554822999999]
[null,"2022-01-17",103.40780633,104.28600553,103.22858809,105.34934411,106.72683478]
[null,"2022-01-18",103.36173784,104.19386015000001,102.98929507,105.38595223,106.76813727]
[null,"2022-01-19",103.61699277,104.43613817000001,103.46692855000001,105.42257302,106.8094557]
[null,"2022-01-20",103.85395583,104.70599066,104.06021607,105.45920649999999,106.85079007]
[null,"2022-01-21",103.90431082000001,104.61457323,103.94667097,105.49585281,106.89214054999999]
[null,"2022-01-24",103.87303048,104.57669503,103.59784653,105.53251181,106.93350698]
[null,"2022-01-25",104.12448643,104.81974681,104.30376216000001,105.56918349,106.97488936000001]
[null,"2022-01-26",104.12943147,104.84651129,104.45707830000001,105.60586800999999,107.01628785]
[null,"2022-01-27",104.09557013,104.77406272,104.5375129,105.64256521,107.0577023]
[null,"2022-01-28",104.15908761999999,104.88449389,104.65799008,105.67927525,107.09913286]
[null,"2022-01-31",104.37644806,105.17130641,105.30626165,105.71599797,107.14057938000001]
[null,"2022-02-01",104.33778952999999,105.24779239999999,105.35188488,105.75273353999999,107.18204203000001]
[null,"2022-02-02",104.32120906,105.21721611,104.97931883,105.78948178,107.22352063]
[null,"2022-02-03",104.35273398,105.20832716,104.75465767,105.83197482999999,107.27082525]
[null,"2022-02-04",104.26357831999999,105.16459146,104.7231857,105.87448500000001,107.31815079]
[null,"2022-02-07",104.24260382999999,105.05949047999999,104.38816249,105.91701213,107.36549709000001]
[null,"2022-02-08",104.16272787,104.97171912,104.29738911,105.95955638,107.41286433]
[null,"2022-02-09",104.24167251999999,105.08078750999999,104.60529513,106.00211776,107.4602525]
[null,"2022-02-10",104.18244376,104.97839802999999,104.50456287999999,106.04469627,107.50766161]
[null,"2022-02-11",104.06900438,104.7598385,104.03064791,106.08729173,107.55509149]
[null,"2022-02-14",104.15246324,104.82261683,104.12089096,106.12990433,107.6025423]
[null,"2022-02-15",104.38097371000001,105.12352327000001,104.72250052,106.17253404,107.65001407]
[null,"2022-02-16",104.3884359,105.14258499,104.72484079,106.21518088000001,107.69750677]
[null,"2022-02-17",104.26612355,104.81082067,103.96961226000001,106.25784485,107.74502043]
[null,"2022-02-18",104.21338505,104.65545288,103.55880198,106.30052594,107.79255503]
[null,"2022-02-21",103.97636471,104.29883992000001,102.56544126,106.34322432,107.84011076]
[null,"2022-02-22",104.07100556,104.36128749,102.86426594,106.38593983,107.88768743]
[null,"2022-02-23",104.06607812999999,104.20719296,102.41645774,106.42867246,107.93528507000001]
[null,"2022-02-24",104.17912982,104.43793302,102.7992289,106.47142221,107.98290366000001]
[null,"2022-02-25",104.26002862999999,104.71604302999999,103.35298774,106.5141891,108.03054322]
[null,"2022-02-28"]
[null,"2022-03-01"]
[null,"2022-03-02",104.29901314999999,104.82438359,103.70238403,106.55697327,108.07820390000001]
[null,"2022-03-03",104.22027893000001,104.60207418,103.35076024,106.59977456,108.12588555000001]
[null,"2022-03-04",104.07889586,104.35474121999999,102.81219405,106.64259315,108.17358833999999]
[null,"2022-03-07",103.66365405000001,103.66874147999999,101.22816311,106.68542886,108.22131209]
[null,"2022-03-08",103.7933261,103.68711785000001,101.33096438,106.7282817,108.26905682]
[null,"2022-03-09",104.07291944000001,104.22561416000001,102.4774943,106.77115182,108.31682269]
[null,"2022-03-10",104.09423811000001,104.20687187999999,102.40214222,106.81403924,108.36460971]
[null,"2022-03-11",103.83843209,103.81991904,101.39485999,106.85694377999999,108.41241770000001]
[null,"2022-03-14",103.71385681,103.52148688,100.73729491,106.89986561000001,108.46024684]
[null,"2022-03-15",103.96457239,103.88307507,101.25046335,106.94280473000001,108.50809713]
[null,"2022-03-16",104.10539939,104.19385136,101.97926774,106.98576097,108.55596841000001]
[null,"2022-03-17",104.23426528,104.47638641,102.49557686,107.0325557,108.60773828000001]
[null,"2022-03-18",104.55244913,105.00692522999999,103.5864615,107.07937085,108.65953278000001]
[null,"2022-03-21",104.46822706,104.90105481000001,103.40188371000001,107.12620658,108.71135209000001]
[null,"2022-03-22",104.67955589,105.26578197000001,104.13474221,107.17306273,108.76319605]
[null,"2022-03-23",104.7732175,105.28268857,104.15825821,107.21993946000001,108.81506482]
[null,"2022-03-24",105.05310239000001,105.82732725,105.00759667,107.26683661,108.86695824]
[null,"2022-03-25",105.32611223000001,106.08547593999999,105.43366885,107.31375434,108.91887647999999]
[null,"2022-03-28",105.34882516,106.14643658,105.44186297,107.36069249000001,108.97081937999999]
[null,"2022-03-29",105.5279314,106.40942195,106.12619266,107.40765123,109.0227871]
[null,"2022-03-30",105.43341918,106.26588316,105.8646482,107.45463055,109.07477964]
[null,"2022-03-31",105.44994758,106.20185321,105.62352976,107.50163044999999,109.12679702]
[null,"2022-04-01",105.75993698000001,106.58054713999999,106.32748438,107.54865076,109.17883906]
[null,"2022-04-04",105.74624031,106.58827218,106.24604908000001,107.59569166999999,109.23090594]
[null,"2022-04-05",105.56431348,106.20085111,105.37379414,107.64275315,109.28299766000001]
[null,"2022-04-06",105.47030905,106.06347562000001,104.9329161,107.68983522000001,109.33511421]
[null,"2022-04-07",105.54777242,106.21913886,105.20781345,107.73693787000001,109.38725561]
[null,"2022-04-08",105.44050094000001,105.97523235,104.74501255,107.78406127,109.43942203]
[null,"2022-04-11",105.20082895,105.48366346,103.81629556999999,107.83120525,109.49161329]
[null,"2022-04-12",105.15646787999999,105.37444292000001,103.52388461,107.87836981,109.54382941]
[null,"2022-04-13",105.28265062,105.60367946,103.9110694,107.92555496,109.59607038]
[null,"2022-04-14",105.25585355,105.47682955000001,103.58268235,107.97276085999999,109.64833637]
[null,"2022-04-15"]
[null,"2022-04-18",105.29365249999999,105.47470291,103.42003934,108.01998734,109.70062722999999]
[null,"2022-04-19",105.37991585,105.57242093000001,103.60319585000001,108.0672344,109.75294294]
[null,"2022-04-20",105.36753263,105.47769018,103.30776632,108.11450221,109.80528369]
[null,"2022-04-21"]
[null,"2022-04-22",105.27327222,105.14290751,102.37989306,108.1617906,109.85764931]
[null,"2022-04-25",105.59660701999999,105.54057003,102.99474511,108.20909974,109.91003997]
[null,"2022-04-26",105.58440761999999,105.31623783000001,102.44037401,108.25642962000001,109.96245566]
[null,"2022-04-27",105.76466404999999,105.58065185,102.89486208,108.30378009,110.01489624]
[null,"2022-04-28",105.8819008,105.81069981,103.32905724,108.35115131000001,110.06736185]
[null,"2022-04-29",105.66062032000001,105.36855848,102.25932007999999,108.39854328,110.11985251999999]
[null,"2022-05-02",105.60535646,105.33474394,101.99047208,108.44595599,110.17236824]
[null,"2022-05-03",105.62510205,105.28466433,101.84146444,108.49338945,110.22490902]
[null,"2022-05-04",105.87392816000001,105.75099031000001,102.72326716000001,108.54084365999999,110.27747485]
[null,"2022-05-05",105.53308219,105.11044404,101.2705083,108.59216089,110.33396964000001]
[null,"2022-05-06",105.45024807999999,104.99427168,100.97509698,108.64350249,110.39049348]
[null,"2022-05-09",105.32678974,104.67946868,99.981090101000007,108.69486829,110.44704622]
[null,"2022-05-10",105.45559052,104.78055080999999,100.190265,108.74625829999999,110.50362783999999]
[null,"2022-05-11",105.40987357,104.7367766,100.10844856,108.79767268000001,110.56023852]
[null,"2022-05-12",105.60165898,104.98561958000001,100.64394041,108.84911142999999,110.61687827]
[null,"2022-05-13",105.8136382,105.32779155,101.38533864,108.90057437999999,110.67354692000001]
[null,"2022-05-16",105.92480427,105.57134569,101.76120114,108.95206171,110.73024464]
[null,"2022-05-17",105.97441329999999,105.613719,101.93897622,109.00357341,110.78697142999999]
[null,"2022-05-18",105.82451087,105.20098551,100.86192376,109.05510947,110.8437273]
[null,"2022-05-19",105.8962587,105.25344834000001,100.94476643,109.10666990999999,110.90051225000001]
[null,"2022-05-20",105.95341716,105.33573796,101.11322367,109.15825470999999,110.95732628]
[null,"2022-05-23",105.98283302,105.47162530999999,101.46421773,109.20986388999999,111.01416940999999]
[null,"2022-05-24",105.91500211,105.30786049,101.26991731,109.26149744,111.07104162]
[null,"2022-05-25",106.03088983000001,105.46445796,101.54971387000001,109.31315536,111.12794292]
[null,"2022-05-26",106.20163853,105.76843285,102.12261968,109.36483781,111.18487349]
[null,"2022-05-27",106.21115043,105.83847228,102.26559743,109.41654463,111.24183316]
[null,"2022-05-30",106.10399246999999,105.61564334000001,101.90901586,109.46827599,111.29882209]
[null,"2022-05-31",106.17043425999999,105.75314039,101.96559331,109.52003172000001,111.35584014]
[null,"2022-06-01",106.23158951000001,105.79711991000001,102.05924586,109.57181198000001,111.41288745999999]
[null,"2022-06-02",106.38541920999999,106.04701000999999,102.64785990999999,109.62361661,111.46996389]
[null,"2022-06-03",106.34272003,105.87755540000001,102.0750915,109.67544578,111.5270696]
[null,"2022-06-06",106.19392062999999,105.70223303,101.52397772,109.72729948999999,111.58420460000001]
[null,"2022-06-07",106.19624699000001,105.73471031,101.5533865,109.77917772000001,111.64136889]
[null,"2022-06-08",106.16268193000001,105.61347877,101.140139,109.8310805,111.69856248000001]
[null,"2022-06-09",106.21672148,105.54348609,100.77022257,109.88300781,111.75578536]
[null,"2022-06-10",106.19356356999999,105.35920818,100.15210064999999,109.93495965,111.81303753]
[null,"2022-06-13",105.98057677,104.87413073,98.934224804999999,109.98693603,111.87031901]
[null,"2022-06-14",105.85725164999999,104.68888934,98.573559930000002,110.03893694,111.92762980000001]
[null,"2022-06-15",106.17763022,105.14282403,99.304893981000006,110.09096255,111.98497005999999]
[null,"2022-06-16"]
[null,"2022-06-17",106.18506339,104.99273841999999,98.636031518999999,110.14494832,112.04430864]
[null,"2022-06-20",106.19639131,104.98498850999999,98.561133755,110.19896061,112.10367869]
[null,"2022-06-21",106.21117997,105.03129676,98.671650286000002,110.25299939999999,112.16308024]
[null,"2022-06-22",106.24018795000001,105.03729758999999,98.545857968999997,110.30706471000001,112.22251326999999]
[null,"2022-06-23",106.35817581000001,105.1726092,98.620632094000001,110.36115653,112.28197779]
[null,"2022-06-24",106.39062765,105.3096834,98.973270948000007,110.41527486,112.3414738]
[null,"2022-06-27",106.4033718,105.38790122,99.201954248000007,110.4694197,112.40100132000001]
[null,"2022-06-28",106.26823983,105.1090665,98.765027309999994,110.52359104999999,112.46056033000001]
[null,"2022-06-29",106.24931689,104.96272868,98.353126247999995,110.57778906999999,112.52015102]
[null,"2022-06-30",106.27084897,104.93832061000001,98.035871709000006,110.63201361,112.57977321]
[null,"2022-07-01",106.4464507,105.19734737,98.538472068000004,110.68626482000001,112.63942709]
[null,"2022-07-04",106.39417374999999,105.07266928,98.285232066999995,110.74054254000001,112.69911248]
[null,"2022-07-05",106.48216248,105.17537053,98.463958625000004,110.79484694,112.75882956]
[null,"2022-07-06",106.66838135,105.37782688,98.971704235999994,110.84917801,112.81857832]
[null,"2022-07-07",106.78882471,105.60818937000001,99.550541136000007,110.9035356,112.87835861000001]
[null,"2022-07-08",106.70123226,105.35789277000001,99.191758750999995,110.95791986,112.93817060000001]
[null,"2022-07-11",106.5142354,105.00143325000001,98.362281834000001,111.0123308,112.99801429]
[null,"2022-07-12",106.69936816000001,105.22415513999999,98.648534443000003,111.06676840999999,113.05788968]
[null,"2022-07-13",106.67917063,105.17037391,98.410288461999997,111.12123269999999,113.11779678000001]
[null,"2022-07-14",106.73062005,105.1222812,98.135694498000007,111.17572382,113.17773576]
[null,"2022-07-15",106.76471530000001,105.25817536,98.268144453000005,111.23024162999999,113.23770645]
[null,"2022-07-18",106.63395088999999,105.03316817,98.028098587000002,111.28478611,113.29770886]
[null,"2022-07-19",106.74753757000001,105.27647227999999,98.665731115,111.33935742,113.35774316]
[null,"2022-07-20",107.02945993,105.65732604,99.350321140999995,111.39395542,113.41780919]
[null,"2022-07-21",107.1188284,105.8375645,99.718906654999998,111.44858025000001,113.47790711]
[null,"2022-07-22",107.13432896,105.81718782,99.479928091999994,111.50323176000001,113.53803676]
[null,"2022-07-25",107.13303860000001,105.77499788,99.394121111999993,111.55791010999999,113.59819831]
[null,"2022-07-26",106.99850024,105.51559854,98.834984098000007,111.61261531,113.65839176999999]
[null,"2022-07-27",107.22387337000001,105.86784848000001,99.619725826000007,111.66734734000001,113.71861714000001]
[null,"2022-07-28",107.33305433,106.08793949,99.994879803000003,111.72210621000001,113.77887441999999]
[null,"2022-07-29",107.41287296,106.27070636000001,100.19731407,111.77689192,113.83916361999999]
[null,"2022-08-01",107.43615307,106.23505485,99.980884454999995,111.83170447000001,113.89948474000001]
[null,"2022-08-02",107.56527349,106.43960149,100.49329299999999,111.88654386,113.95983778999999]
[null,"2022-08-03",107.90827667000001,106.90884834000001,101.40322721,111.94141026,114.02022291999999]
[null,"2022-08-04",108.34673691,107.53830087,102.50115005000001,111.99826317,114.08263613]
[null,"2022-08-05",108.40240298000001,107.59769518,102.53330644,112.05514488999999,114.14508343999999]
[null,"2022-08-08",108.52803935,107.83088644999999,102.90119197999999,112.11205542,114.20756487]
[null,"2022-08-09",108.429344,107.68032989,102.60993555,112.16899494,114.27008057]
[null,"2022-08-10",108.64205963000001,108.01527847,103.46270336000001,112.22596344,114.33263055]
[null,"2022-08-11",108.65686666000001,108.00469454,103.37841489,112.28296075,114.39521465999999]
[null,"2022-08-12",109.008045,108.58817329999999,104.57629411000001,112.33998705,114.45783305]
[null,"2022-08-15",109.31847884,108.99949601,105.3215177,112.39704233,114.52048574]
[null,"2022-08-16",109.32135131,108.98665582,105.34647359,112.45412657999999,114.58317273]
[null,"2022-08-17",109.39563547,109.02230996,105.46975088000001,112.51123982,114.64589402999999]
[null,"2022-08-18",109.35496544999999,108.96632892,105.31390191,112.56838204,114.70864963]
[null,"2022-08-19",109.19698640999999,108.59611556999999,104.4115378,112.62555324,114.77143954]
[null,"2022-08-22",109.13799448,108.35499960999999,103.86545812999999,112.68275359,114.83426393000001]
[null,"2022-08-23",109.29310793000001,108.6513534,104.44091447,112.73998290999999,114.89712264000001]
[null,"2022-08-24",109.42244784,108.7650692,104.73439716999999,112.79724138,114.96001584]
[null,"2022-08-25",109.50437469000001,108.85720800999999,105.11624261999999,112.85452884,115.02294336]
[null,"2022-08-26",109.47248936,108.63272154000001,104.46719014999999,112.91184543,115.08590538]
[null,"2022-08-29",109.46630809,108.50658387999999,104.37603455,112.96919118,115.14890191000001]
[null,"2022-08-30",109.43682591,108.36310512,103.85343797,113.02656607,115.21193293]
[null,"2022-08-31",109.66042931,108.61933691,104.18550977,113.0839701,115.27499847]
[null,"2022-09-01",109.88317093000001,108.9468498,104.64219025,113.14140328000001,115.33809850999999]
[null,"2022-09-02",109.98013516,109.01407738,104.71144113,113.19886561,115.40123308]
[null,"2022-09-05",110.08908081,109.13554316,105.03269175,113.25635708,115.46440216000001]
[null,"2022-09-06",109.92337173,108.78460825000001,104.19676054999999,113.31387770000001,115.52760576999999]
[null,"2022-09-07"]
[null,"2022-09-08",110.06552969000001,109.01734256,104.49213089,113.37142763,115.59084407]
[null,"2022-09-09",110.23612523,109.35008521,105.24987127999999,113.4290067,115.65411690000001]
[null,"2022-09-12",110.22527415,109.34854819,105.34135667,113.48661508000001,115.71742444]
[null,"2022-09-13",110.09652868000001,108.92272075,104.3360244,113.54425277,115.78076668]
[null,"2022-09-14",110.12972327,108.93711838,104.31658143999999,113.60191961,115.84414347000001]
[null,"2022-09-15",110.14016807,108.86431127,104.17790050000001,113.65961575999999,115.90755497000001]
[null,"2022-09-16",110.29043655,108.99590243,104.25264939,113.71734121999999,115.97100119]
[null,"2022-09-19",110.45004023,109.25866825999999,104.83317974000001,113.77509599,116.03448213]
[null,"2022-09-20",110.4209212,109.22902755,104.73041085,113.83288007,116.0979978]
[null,"2022-09-21",110.52711974,109.2871394,104.64397939,113.89069363,116.16154836]
[null,"2022-09-22",110.78336389,109.65484377999999,105.29432161,113.94853649,116.22513366]
[null,"2022-09-23",110.72877274,109.41722360999999,104.70876577,114.00640867,116.28875368999999]
[null,"2022-09-26",110.59371424,109.15040805,103.98718097,114.06431031,116.35240863999999]
[null,"2022-09-27",110.6003614,109.12936199000001,103.6875115,114.12224127,116.41609832]
[null,"2022-09-28",110.66026128999999,109.19155241999999,103.90051439,114.18020171000001,116.47982293]
[null,"2022-09-29",110.61947225999999,109.05920734,103.3967198,114.23819161999999,116.54358246]
[null,"2022-09-30",110.93541671,109.50134344,104.27224484,114.296211,116.60737691]
[null,"2022-10-03",111.12607515000001,109.96547692999999,105.57148958000001,114.35425986,116.67120629]
[null,"2022-10-04",111.13330136,110.06565757,105.72024798,114.41233819999999,116.7350706]
[null,"2022-10-05",111.28370457,110.26897004999999,106.11050444999999,114.47044601,116.79896985000001]
[null,"2022-10-06",111.43301977,110.40250143,106.49301787,114.52858329,116.86290403]
[null,"2022-10-07",111.41068067,110.17819793,105.94547851,114.58675005000001,116.92687316999999]
[null,"2022-10-10",111.42429473,110.11462975000001,105.75459379999999,114.64494645000001,116.99087741]
[null,"2022-10-11",111.32672767,109.93090395,105.29818898000001,114.70317231999999,117.05491661000001]
[null,"2022-10-12"]
[null,"2022-10-13",111.43585983,110.10188743,105.50078929,114.76142783,117.11899093]
[null,"2022-10-14",111.26700321,109.74571096,104.57473057999999,114.81971299,117.18310038]
[null,"2022-10-17",111.3982926,110.0704441,105.14222647,114.87802761,117.24724479]
[null,"2022-10-18",111.57897268000001,110.36594684000001,105.8032887,114.93637188,117.31142434]
[null,"2022-10-19",111.5837054,110.37288817,105.77287525,114.99474579,117.37563903]
[null,"2022-10-20",111.51526143,110.31458508,105.62251223,115.05314933,117.43988885]
[null,"2022-10-21",111.70852386999999,110.70288428000001,106.48753678,115.11158252,117.50417383]
[null,"2022-10-24",111.71200028,110.57645089,106.04056588,115.17004550999999,117.56849412]
[null,"2022-10-25",111.72421154,110.55851076,105.83243238999999,115.22853814,117.63284957]
[null,"2022-10-26",111.54123731,110.24812196000001,104.99995905,115.28706041,117.69724017999999]
[null,"2022-10-27",111.80794443000001,110.4808716,105.56180069,115.34561248,117.76166610999999]
[null,"2022-10-28",111.98202695000001,110.7929749,106.09360624,115.40419419,117.82612721]
[null,"2022-10-31",112.24655103000001,111.07106692000001,106.66067165,115.46280571,117.89062364999999]
[null,"2022-11-01",112.24971418,111.06979859,106.72062192,115.52144703,117.95515544]
[null,"2022-11-02"]
[null,"2022-11-03",112.32124254,110.95653423,106.59891322999999,115.58011815,118.01972256000001]
[null,"2022-11-04",112.31508700000001,110.9960174,106.71597171000001,115.63881908,118.08432504]
[null,"2022-11-07",112.02762408,110.60623566,105.71867954,115.69754982000001,118.14896287000001]
[null,"2022-11-08",112.15754504,110.75998724,106.01024198,115.75631035000001,118.21363606]
[null,"2022-11-09",112.05564658,110.45458762,105.20589889,115.8151007,118.27834461]
[null,"2022-11-10",111.45103056000001,109.75450737,103.89154705,115.87392084,118.34308851999999]
[null,"2022-11-11",111.43873766999999,109.85835648,104.23061411,115.93277096,118.40786797]
[null,"2022-11-14",111.66461747,110.22141589,104.65305102000001,115.99165087999999,118.4726828]
[null,"2022-11-15"]
[null,"2022-11-16",111.34382900999999,109.70660142,103.50506502,116.05056076,118.53753317]
[null,"2022-11-17",111.30946996,109.62513215,103.14054446999999,116.10950062000001,118.60241909]
[null,"2022-11-18",111.13489949,109.33878301,102.65039912,116.16847027999999,118.66734039000001]
[null,"2022-11-21",111.32893306,109.510031,102.97629581,116.22746991,118.73229725]
[null,"2022-11-22",111.19436342,109.35426299,102.67124681,116.28649951,118.79728967]
[null,"2022-11-23",111.14417735000001,109.23804721,102.50504548000001,116.34555908,118.86231766]
[null,"2022-11-24",111.43613901000001,109.75189721,103.50493114,116.40464878,118.92738138]
[null,"2022-11-25",111.23544133,109.37255140000001,102.60878418999999,116.46376845,118.99248067000001]
[null,"2022-11-28",111.29634089,109.38114372,102.35866025,116.52291809,119.05761554]
[null,"2022-11-29",111.57752065,109.85735613999999,103.00411937,116.58209786,119.12278616]
[null,"2022-11-30",111.76739229,110.26489374000001,103.62268895,116.6413076,119.18799237]
[null,"2022-12-01",111.56529542,109.94667984,102.93569448,116.70054747,119.25323433]
[null,"2022-12-02",111.81454540999999,110.28213832,103.51467728,116.75981732,119.31851188]
[null,"2022-12-05",111.60223229,109.83137263,102.4954845,116.81911728999999,119.3838252]
[null,"2022-12-06",111.60621888999999,109.72414933,102.40514453,116.87844741000001,119.44917427999999]
[null,"2022-12-07",111.64352429,109.67953297,102.13233104,116.93780765,119.51455914]
[null,"2022-12-08",111.44439106,109.39112255000001,101.32233527,116.99719803000001,119.57997976999999]
[null,"2022-12-09",111.43951296,109.363516,101.23813327000001,117.05661854,119.64543618]
[null,"2022-12-12",111.32837952,109.13219579,100.74250764,117.11606935,119.71092855000001]
[null,"2022-12-13",111.10524237,108.82805913999999,100.04199413000001,117.17555029,119.7764567]
[null,"2022-12-14",111.21415558,108.86752771,100.15204943000001,117.23506153,119.84202082]
[null,"2022-12-15",111.27495140000001,108.85222455,99.938700392000001,117.29460290999999,119.90762073]
[null,"2022-12-16",111.08728623,108.53444588000001,99.282407707000004,117.35417458000001,119.9732566]
[null,"2022-12-19",111.2959565,108.76565179000001,99.850593666999998,117.41377639,120.03892829]
[null,"2022-12-20",111.59015053,109.17250721000001,100.64833604,117.47340849,120.10463593999999]
[null,"2022-12-21",111.69135606,109.34354609,100.99441053,117.53307089,120.17037958]
[null,"2022-12-22",111.76990941,109.38592341,100.92817402999999,117.59276359,120.2361592]
[null,"2022-12-23",112.04690804000001,109.82378267,101.82384913,117.65248659,120.30197481]
[null,"2022-12-26",112.08444071,109.81034516,101.68708998,117.71224005000001,120.36782658]
[null,"2022-12-27",112.15907015000001,109.94016688000001,101.75779466,117.77202380999999,120.43371433999999]
[null,"2022-12-28",112.48401966,110.35625801,102.51032949,117.83183787,120.49963811000001]
[null,"2022-12-29",112.47586517000001,110.40844251999999,102.48778428,117.89168239,120.56559805000001]
[null,"2022-12-30",112.52457407,110.45017488000001,102.50504179000001,117.95155721,120.63159399]
[null,"2023-01-02",112.38826449,110.10809669,101.69354359,118.01146249999999,120.69762612]
[null,"2023-01-03",112.19254899000001,109.75285451000001,100.93556561,118.07139823999999,120.76369443]
[null,"2023-01-04",112.32809148,109.88958941999999,101.3470059,118.13136445000001,120.82979892]
[null,"2023-01-05",112.55805508,110.18620241000001,101.94777103,118.19136112,120.89593961]
[null,"2023-01-06",112.62628822000001,110.37248966,102.20958668999999,118.25138825000001,120.96211649999999]
[null,"2023-01-09",112.73859638,110.52940368,102.42610648,118.31144585,121.02832958]
[null,"2023-01-10",112.98671268,110.92049753000001,103.16124105999999,118.37153391,121.09457887000001]
[null,"2023-01-11",113.14107627999999,111.26631856,103.67038018,118.43165243,121.16086437]
[null,"2023-01-12",112.78961885,110.9354561,102.95711695,118.49180158,121.22718625]
[null,"2023-01-13",112.68849723,110.80573076,102.58283972,118.55198119000001,121.29354434]
[null,"2023-01-16",112.50123952,110.46941151999999,102.05550476000001,118.61219143,121.35993882]
[null,"2023-01-17",112.60736971,110.70849401,102.5895647,118.6724323,121.4263697]
[null,"2023-01-18",112.6393137,110.76722336,102.80534686,118.73270363,121.49283680000001]
[null,"2023-01-19",112.77476900000001,110.91688952,103.08443384,118.79300559000001,121.55934031]
[null,"2023-01-20",112.69584835000001,110.79321962,102.98445962,118.85333817,121.62588021000001]
[null,"2023-01-23",112.65540016999999,110.73732266,102.91170756,118.91370139,121.69245653]
[null,"2023-01-24",112.80319618999999,110.96325511000001,103.26750217,118.97409539,121.75906943]
[null,"2023-01-25",112.90224121999999,111.07069373,103.48572145999999,119.03452002,121.82571874]
[null,"2023-01-26",112.92537271,111.10088478,103.56546489999999,119.09497528,121.89240448]
[null,"2023-01-27",112.79521502,110.89120764,103.07103062,119.15546134,121.95912680000001]
[null,"2023-01-30",112.83316883000001,110.86430618999999,102.92545703,119.21597801999999,122.02588556000001]
[null,"2023-01-31",113.04863562,111.14045585,103.50911108,119.27652549,122.09268092000001]
[null,"2023-02-01",112.98390191,111.05065997,103.22267610999999,119.33710375,122.15951287999999]
[null,"2023-02-02",112.82980080999999,110.83521446,102.74573396,119.39771263999999,122.22638128]
[null,"2023-02-03",112.69952351000001,110.57497804,102.25220087,119.45835233,122.29328630000001]
[null,"2023-02-06",112.78973413999999,110.70184098,102.29669226,119.5190228,122.36022792999999]
[null,"2023-02-07",112.75437973,110.74516654,102.19594619999999,119.57972424,122.42720636]
[null,"2023-02-08",112.95037436,111.0352547,102.6574454,119.64045646,122.49422140999999]
[null,"2023-02-09",112.77870029,110.76133335999999,101.97016164999999,119.70121948000001,122.56127308000001]
[null,"2023-02-10",112.83545075000001,110.78852797,101.93908924,119.76201345,122.62836156]
[null,"2023-02-13",112.74953314,110.7415699,101.90075567,119.82283821999999,122.69548668]
[null,"2023-02-14",112.64776845,110.66402078,101.56939364999999,119.88369394,122.76264861]
[null,"2023-02-15",112.99685900999999,111.22539978,102.51311065,119.94458046,122.82984718]
[null,"2023-02-16",113.04214063000001,111.24767837,102.52359374,120.00549793,122.89708256999999]
[null,"2023-02-17",113.10373122999999,111.24049572,102.3348373,120.06644636,122.96435479]
[null,"2023-02-20"]
[null,"2023-02-21"]
[null,"2023-02-22",112.96863234,110.82502762,101.46720189,120.12742575,123.03166383]
[null,"2023-02-23",112.92369551,110.78439444,101.36474564,120.18843609,123.0990097]
[null,"2023-02-24",112.91478565,110.62281328,101.02412524,120.24947739,123.16639240000001]
[null,"2023-02-27",113.04013715000001,110.80848481,101.174809,120.31054981,123.23381211]
[null,"2023-02-28",112.98955527,110.69672581,100.93267932000001,120.37165319,123.30126867]
[null,"2023-03-01",112.94933478999999,110.57078284000001,100.62384523,120.43278752000001,123.36876207]
[null,"2023-03-02",112.94647539,110.50474035000001,100.53934292,120.49395298,123.43629249]
[null,"2023-03-03",113.00825897,110.65009299,100.8401745,120.55514956,123.50385993]
[null,"2023-03-06",113.14392063,110.81033877,101.14217529,120.61637709,123.57146424]
[null,"2023-03-07",113.19996147000001,110.84450335,101.04295009000001,120.67763574999999,123.63910557]
[null,"2023-03-08",113.4093582,111.17680300000001,101.72153608000001,120.73892552,123.70678393999999]
[null,"2023-03-09",113.53799394000001,111.24292002,101.52469886,120.80024641999999,123.77449935]
[null,"2023-03-10",113.46526471,111.04544301999999,101.01248,120.86159843999999,123.8422518]
[null,"2023-03-13",113.60315597,111.27376896,101.17007580000001,120.92298175000001,123.91004147]
[null,"2023-03-14",113.58251791000001,111.24803649,101.13087544,120.98439618,123.9778682]
[null,"2023-03-15",113.7164641,111.39038203,101.23247687,121.04584173000001,124.04573197000001]
[null,"2023-03-16",113.77995734,111.54374525,101.52477494999999,121.10731857,124.11363298000001]
[null,"2023-03-17",113.77912402,111.51181751,101.21656470000001,121.16882652,124.18157105]
[null,"2023-03-20",113.62905666,111.29626330000001,100.57683584,121.23036577000001,124.24954636]
[null,"2023-03-21",113.62529947,111.35056118999999,100.62301897,121.2919363,124.31755891]
[null,"2023-03-22",113.70859280000001,111.37311252000001,100.49290877,121.35353811,124.38560870000001]
[null,"2023-03-23",113.50221184,111.09266297000001,99.674224054000007,121.41517122,124.45369574999999]
[null,"2023-03-24",113.77979169,111.43765246,100.30675315000001,121.4768356,124.52182003999999]
[null,"2023-03-27",113.79989519,111.48976793999999,100.34988305,121.53853128,124.5899816]
[null,"2023-03-28",113.82461253,111.51315266,100.51768631,121.60025824,124.65818041999999]
[null,"2023-03-29",113.73689552,111.46684784,100.39036265,121.66201665,124.72641667000001]
[null,"2023-03-30",113.94094053000001,111.80246320000001,100.9901593,121.72380635,124.79469019]
[null,"2023-03-31",113.88361573,111.66180190999999,100.57524518,121.7856275,124.86300115]
[null,"2023-04-03",113.84401338000001,111.62856744,100.30055661999999,121.8474801,124.93134956]
[null,"2023-04-04",113.97686057,111.79131340000001,100.53742514,121.90936397999999,124.99973525999999]
[null,"2023-04-05",113.92632977,111.64924805,100.05167588,121.97127931999999,125.0681584]
[null,"2023-04-06",113.98318488,111.68318838,100.1297069,122.03322611,125.13661901]
[null,"2023-04-07"]
[null,"2023-04-10",114.08021167,111.8068464,100.40890955,122.09520434,125.20511707999999]
[null,"2023-04-11",114.40789536,112.36467102,101.63921928000001,122.15721403000001,125.27365261999999]
[null,"2023-04-12",114.43530379000001,112.34902972,101.61536639000001,122.21925534,125.34222579999999]
[null,"2023-04-13",114.48672854,112.48211406999999,101.67637963,122.28132809,125.41083645000001]
[null,"2023-04-14",114.53372062,112.49680761,101.65668272000001,122.3434323,125.47948459]
[null,"2023-04-17",114.57571077999999,112.5484494,101.66707057000001,122.40556812,125.54817038]
[null,"2023-04-18",114.57247667999999,112.55315976,101.65847212,122.46773555999999,125.61689382]
[null,"2023-04-19",114.46894589,112.3457923,101.1436593,122.52993445,125.68565476000001]
[null,"2023-04-20",114.62439983,112.51742849999999,101.35550248,122.59216495,125.75445336]
[null,"2023-04-21"]
[null,"2023-04-24",114.68460414,112.54119394,101.24488214,122.65442707,125.82328963]
[null,"2023-04-25",114.69173180999999,112.51112392,100.93943671,122.7167208,125.89216358]
[null,"2023-04-26",114.75189268,112.52542391,100.83226711,122.77904615,125.9610752]
[null,"2023-04-27",114.8507079,112.71828120000001,101.22297549,122.84140327999999,126.03002468]
[null,"2023-04-28",115.0494432,112.94779397000001,101.95614179,122.90379203000001,126.09901184]
[null,"2023-05-01"]
[null,"2023-05-02",115.03279965,112.77683437,101.37682812,122.96621239,126.16803668999999]
[null,"2023-05-03",115.16219009,112.88253721,101.45182641,123.02866453,126.23709940000001]
[null,"2023-05-04",115.29102691,113.04564112,101.61723550000001,123.09114845000001,126.30619999]
[null,"2023-05-05",115.54025502,113.50602597,102.69486883,123.15366399,126.37533827]
[null,"2023-05-08",115.62648978,113.66543118,103.08395016,123.21621131000001,126.44451443]
[null,"2023-05-09",115.74641333,113.77339385000001,103.39554452,123.27879040000001,126.51372847]
[null,"2023-05-10",115.88404606,113.95252936999999,103.69956419,123.34140128,126.5829804]
[null,"2023-05-11",116.13023034,114.27753156999999,104.26042941999999,123.40404393999999,126.65227021]
[null,"2023-05-12",116.18451165,114.35288616,104.27394313000001,123.46671838,126.72159791999999]
[null,"2023-05-15",116.37065164000001,114.58984049,104.64845947000001,123.52942476,126.79096369]
[null,"2023-05-16",116.26923908000001,114.43733693,104.25117186,123.59216292000001,126.86036736]
[null,"2023-05-17",116.54328526,114.80452323,105.12150126,123.65493303,126.92980910999999]
[null,"2023-05-18",116.7737554,115.10937303,105.79008128,123.71773492,126.99928876]
[null,"2023-05-19",116.91842169,115.29705980999999,106.14098124,123.78056875,127.06880649999999]
[null,"2023-05-22",116.98180053,115.27783114,106.09704779,123.84343453,127.13836233000001]
[null,"2023-05-23",117.02460137,115.28326874,105.89231819,123.90633225000001,127.20795624]
[null,"2023-05-24",117.00857123,115.18672509,105.46824846,123.96926191999999,127.27758826]
[null,"2023-05-25",117.34453483999999,115.75845436,106.54517188,124.03222353,127.34725837000001]
[null,"2023-05-26",117.5186671,116.0087609,107.01074923,124.09521709000001,127.41696657999999]
[null,"2023-05-29",117.54271577,116.02180828,106.93606178,124.15824259,127.4867129]
[null,"2023-05-30",117.61730668,116.06220972,106.77639763000001,124.2213002,127.55649751]
[null,"2023-05-31",117.78205369,116.17646839,106.96115516,124.28438975,127.62632022]
[null,"2023-06-01",117.93885916000001,116.42957765,107.57471265,124.34751142,127.69618122999999]
[null,"2023-06-02",117.99727900000001,116.63377672,107.93006233,124.41066503,127.76608037]
[null,"2023-06-05",118.12308885,116.80463773,108.03856214,124.47385075,127.83601779999999]
[null,"2023-06-06",118.359279,117.13557632,108.74116076,124.53706858,127.90599353]
[null,"2023-06-07",118.37810793,117.09359708,108.84680658000001,124.60031852,127.97600756999999]
[null,"2023-06-08"]
[null,"2023-06-09",118.51697556000001,117.3543378,109.27901502,124.66360057,128.04605992]
[null,"2023-06-12",118.55995274,117.42611170000001,109.4022861,124.72691472,128.11615058999999]
[null,"2023-06-13",118.36981725,117.15673332,108.86120215,124.79026116,128.18627974]
[null,"2023-06-14",118.65687782000001,117.57825776,109.75430806,124.8536397,128.25644721]
[null,"2023-06-15",118.76705013,117.74854027000001,110.03430073,124.91705035,128.32665302000001]
[null,"2023-06-16",118.86077123,117.83020952,110.07037925,124.98049327,128.39689731999999]
[null,"2023-06-19",118.93520753999999,117.88133816,110.24044370999999,125.04396847,128.46718013]
[null,"2023-06-20",119.06794613,118.00702243000001,110.44054097999999,125.10747578,128.53750127999999]
[null,"2023-06-21",119.15235624,118.09318236999999,110.53359623,125.17101536,128.60786093999999]
[null,"2023-06-22",119.05792827,117.94129452999999,110.01395050000001,125.23458721999999,128.67825912000001]
[null,"2023-06-23",119.22291491,118.10453944,110.23114123000001,125.29819135,128.74869581999999]
[null,"2023-06-26",119.14786485,117.94122288,109.71195916000001,125.36182792,128.81917121999999]
[null,"2023-06-27",119.12015682000001,117.93533759,109.52447651,125.42549677,128.88968514000001]
[null,"2023-06-28",119.21345015,117.98948376,109.59109072,125.48919788000001,128.96023761000001]
[null,"2023-06-29",119.4796638,118.37755745,110.38519218,125.55293143999999,129.03082878000001]
[null,"2023-06-30",119.69629596,118.67752444,110.74766492000001,125.61669727,129.10145849]
[null,"2023-07-03",119.79074986000001,118.90550184,111.13733345999999,125.68049554,129.17212692000001]
[null,"2023-07-04",119.82356237,118.84888959,111.08285406,125.74432625,129.24283406999999]
[null,"2023-07-05",120.01255711,119.03756074,111.61469681,125.8081894,129.31357994999999]
[null,"2023-07-06",119.9522559,118.85160616,111.11321574999999,125.87208499,129.38436454999999]
[null,"2023-07-07",120.24994719,119.22104127,111.80657834,125.93601301,129.45518788999999]
[null,"2023-07-10",120.16036681,119.02619528,111.36761555,125.99997347,129.52604997]
[null,"2023-07-11",120.19139174999999,119.04850059,111.26220078,126.06396638,129.59695078999999]
[null,"2023-07-12",120.08558671,118.95588432,110.97046290999999,126.12799172,129.66789034999999]
[null,"2023-07-13",120.1196913,119.06606837,111.26120305000001,126.19204966,129.73886884000001]
[null,"2023-07-14",119.96564746,118.77787970999999,110.55834587,126.25614005,129.80988608000001]
[null,"2023-07-17",120.13477287000001,119.01807246,110.94225994,126.32026304,129.88094225]
[null,"2023-07-18",120.24626144,119.18006681,111.09472049999999,126.38441863,129.95203735000001]
[null,"2023-07-19",120.21745373,119.09840328999999,110.87088381,126.44860681999999,130.02317138999999]
[null,"2023-07-20",120.22163105,119.05923546,110.80374322,126.51282762,130.09434436999999]
[null,"2023-07-21",120.46245705,119.41260624,111.5065372,126.57708101999999,130.16555629999999]
[null,"2023-07-24",120.54774827999999,119.53617015,111.73048147,126.64136703,130.23680718]
[null,"2023-07-25",120.67073153,119.75001992,112.08347553999999,126.70568564,130.30809701000001]
[null,"2023-07-26",120.72757129,119.79903443000001,112.07986366,126.77003701,130.37942597]
[null,"2023-07-27",120.65557385,119.57674062,111.47876157,126.83442099,130.45079389]
[null,"2023-07-28",120.80382799,119.77604116000001,111.83213292000001,126.89883774,130.52220095000001]
[null,"2023-07-31",121.04100375,120.12442862,112.50980935,126.96328708999999,130.59364697999999]
[null,"2023-08-01",121.11448767,120.19961291,112.53786101,127.02776921,130.66513215000001]
[null,"2023-08-02",121.24532696999999,120.25505773,112.49964377000001,127.0922841,130.73665647999999]
[null,"2023-08-03",121.4244747,120.50252114,112.87203725000001,127.15460698,130.8059313]
[null,"2023-08-04",121.55897379,120.54674509,112.86143611,127.21696049000001,130.87524289000001]
[null,"2023-08-07",121.59930219,120.60524291,112.8966274,127.27934446,130.94459108999999]
[null,"2023-08-08",121.73203350999999,120.75758946000001,112.92416376,127.34175906,131.01397607999999]
[null,"2023-08-09",121.67071799,120.61557107,112.51864609,127.40420428,131.08339785000001]
[null,"2023-08-10",121.69519668,120.62093802,112.43043222,127.46668013,131.15285641]
[null,"2023-08-11",121.76441131,120.68799151,112.39411029999999,127.52918662,131.22235176999999]
[null,"2023-08-14",121.66640164,120.55176037,112.01472878,127.59172372,131.29188393000001]
[null,"2023-08-15",121.73978356000001,120.54502735,111.91512394,127.65429146,131.36145289000001]
[null,"2023-08-16",121.75779113,120.47722295,111.67879836,127.71688999,131.43105883000001]
[null,"2023-08-17",121.66243717,120.27030806,111.19183359,127.77951914,131.50070158]
[null,"2023-08-18",121.76485997,120.35249930000001,111.35980517,127.84217909,131.57038132]
[null,"2023-08-21",121.70015925,120.22134083,111.10710546,127.90486966,131.64009787000001]
[null,"2023-08-22",121.85536057,120.39589601,111.56836681999999,127.96759102999999,131.70985142000001]
[null,"2023-08-23",121.9965943,120.66243134,112.02724368,128.03034319,131.77964197]
[null,"2023-08-24",121.95846864000001,120.49672268,111.5285985,128.09312598,131.84946934999999]
[null,"2023-08-25",121.85523252999999,120.31793231,111.04566541,128.15593956000001,131.91933373000001]
[null,"2023-08-28",121.92608233,120.4785146,111.29701301999999,128.21878409999999,131.98923529000001]
[null,"2023-08-29",122.0562508,120.75445791,111.78402413000001,128.28165942000001,132.05917387]
[null,"2023-08-30",122.06803995,120.72381022,111.66725286,128.34456553999999,132.12914946000001]
[null,"2023-08-31",121.92170159,120.45667245,111.11411346,128.40750245999999,132.19916208000001]
[null,"2023-09-01",122.13727627,120.75061743000001,111.85846981,128.47047033000001,132.26921189000001]
[null,"2023-09-04",122.1458935,120.72898044,111.77560169,128.53346898999999,132.33929873]
[null,"2023-09-05",122.12019533,120.67493469999999,111.62136769999999,128.59649861,132.40942276999999]
[null,"2023-09-06",122.11776067,120.5706418,111.24347330000001,128.65955918,132.47958402]
[null,"2023-09-07"]
[null,"2023-09-08",122.21286803,120.61325657,111.19315659999999,128.72265055,132.54978231999999]
[null,"2023-09-11",122.267915,120.76596456,111.48907237,128.78577286999999,132.62001781999999]
[null,"2023-09-12",122.50926351,121.05370757,112.04579606999999,128.84892615000001,132.69029054999999]
[null,"2023-09-13",122.51762168,121.05266448,111.96356737000001,128.91211039000001,132.76060050000001]
[null,"2023-09-14",122.50284533999999,121.09815218999999,112.02439750000001,128.97532559000001,132.83094768999999]
[null,"2023-09-15",122.47619160000001,120.91807715,111.65868938,129.03857189999999,132.90133227000001]
[null,"2023-09-18",122.47227337,120.85068601,111.45664678,129.10184917000001,132.97175408999999]
[null,"2023-09-19",122.42485622,120.75761446999999,111.20070919,129.1651574,133.04221314]
[null,"2023-09-20",122.53022135000001,120.87594581,111.38699523,129.22849676000001,133.11270962]
[null,"2023-09-21",122.45112163,120.6162167,110.64203042,129.28959502999999,133.18090291999999]
[null,"2023-09-22",122.43603575,120.56241523,110.44758524,129.35072212,133.24913108000001]
[null,"2023-09-25",122.42079203,120.49974214,110.33416076,129.41187819000001,133.31739429000001]
[null,"2023-09-26",122.21270197,119.97828905,109.44433803,129.47306308,133.38569236000001]
[null,"2023-09-27",122.21911623,119.96354589000001,109.50925236,129.53427694000001,133.45402547]
[null,"2023-09-28",122.45110343,120.35289935999999,110.19175466999999,129.59551979,133.52239363999999]
[null,"2023-09-29",122.66513897999999,120.66751128,110.68361691,129.65679162000001,133.59079685]
[null,"2023-10-02",122.51786426,120.39547625,110.13342849999999,129.71809227,133.65923495000001]
[null,"2023-10-03",122.35392650999999,120.04100441999999,109.45046992,129.77942189000001,133.72770811000001]
[null,"2023-10-04",122.55906117000001,120.33026033,109.83686423,129.84078066000001,133.79621650000001]
[null,"2023-10-05",122.54524255,120.29830973,109.67476067,129.90216842000001,133.86475995999999]
[null,"2023-10-06",122.59524811999999,120.4884629,109.88086717,129.96358515,133.93333849000001]
[null,"2023-10-09",122.74790487999999,120.73772270000001,110.20194232999999,130.02503086999999,134.00195209]
[null,"2023-10-10",122.91861763999999,120.97896272,110.73975964,130.08650573,134.07060093999999]
[null,"2023-10-11",122.85904637,120.93205851,110.64067135000001,130.14800957,134.13928487000001]
[null,"2023-10-12"]
[null,"2023-10-13",122.71287581999999,120.63343979,109.97966552,130.20954255000001,134.20800406000001]
[null,"2023-10-16",122.86016605,120.85591212999999,110.29716118,130.27110468000001,134.27675851000001]
[null,"2023-10-17",122.69566811999999,120.56588904,109.74518551,130.33269580000001,134.34554804999999]
[null,"2023-10-18",122.57944723999999,120.31486842,109.00034900999999,130.39431605999999,134.41437285999999]
[null,"2023-10-19",122.50113989,120.0843529,108.74073537,130.45596545999999,134.48323293999999]
[null,"2023-10-20",122.61457892999999,120.11143676,108.54581039999999,130.51764401,134.55212829000001]
[null,"2023-10-23",122.74289093,120.19002376,108.7332218,130.57935169999999,134.62105893]
[null,"2023-10-24",122.87049582,120.42323853000001,109.05079961,130.64108855000001,134.69002484000001]
[null,"2023-10-25",122.78274307,120.18701442,108.42771093,130.70285469999999,134.75902622000001]
[null,"2023-10-26",123.08287507,120.62778231999999,109.07003179,130.76464999000001,134.82806288]
[null,"2023-10-27",122.8502994,120.25090520000001,108.32084231,130.82647442999999,134.89713484000001]
[null,"2023-10-30",122.79413379,120.15325512,108.15747395,130.88832819000001,134.96624226]
[null,"2023-10-31",122.96747592,120.347847,108.55606229,130.95021125,135.03538516]
[null,"2023-11-01",123.12596875,120.6556211,109.05746838,131.01212346,135.10456335999999]
[null,"2023-11-02"]
[null,"2023-11-03",123.42337266,121.22480274,110.29501059,131.07175128,135.17139098000001]
[null,"2023-11-06",123.32004451,121.07264393,110.01372446000001,131.13140611,135.23825152000001]
[null,"2023-11-07",123.57090975,121.42109814,110.64038838,131.19108811000001,135.30514514999999]
[null,"2023-11-08",123.67836281,121.59777208,110.81914082999999,131.25079726999999,135.37207187000001]
[null,"2023-11-09",123.69786209999999,121.56401596000001,110.69418376,131.31053360999999,135.43903169999999]
[null,"2023-11-10",123.94000041,121.9421664,111.45342644,131.37029712,135.50602462000001]
[null,"2023-11-13",123.93960645,121.87874782,111.29869686000001,131.43008796000001,135.57305081999999]
[null,"2023-11-14",124.24052594,122.47567173,112.41102186000001,131.48990597,135.64011013000001]
[null,"2023-11-15"]
[null,"2023-11-16",124.44197988000001,122.78087853,112.97454023,131.54975114999999,135.70720255000001]
[null,"2023-11-17",124.53284592,122.94114113000001,113.11808033,131.60962366000001,135.77432825]
[null,"2023-11-20",124.56473295000001,122.99307892,113.2966498,131.66952334000001,135.84148708000001]
[null,"2023-11-21",124.46048860000001,122.84342472,112.93846105,131.72945035999999,135.90867919999999]
[null,"2023-11-22",124.53790395,122.99620987,113.08166786,131.78940455,135.97590445]
[null,"2023-11-23",124.60506804000001,123.07224497,113.20233817,131.84938607000001,136.04316299999999]
[null,"2023-11-24",124.56083688,122.95984648,112.77788357999999,131.90939492999999,136.11045485]
[null,"2023-11-27",124.6693617,123.09885087000001,112.91992064999999,131.96943112,136.17778000999999]
[null,"2023-11-28",124.83275451999999,123.30242149,113.29975030999999,132.02949464,136.24513848000001]
[null,"2023-11-29",124.87289986,123.33481777999999,113.23995106,132.0895855,136.31253027]
[null,"2023-11-30",125.10345646,123.6320328,113.82425091,132.14970369,136.37995537]
[null,"2023-12-01",125.29240523,123.86482424,114.29690866,132.20984922,136.44741379999999]
[null,"2023-12-04",125.17673871,123.65725372999999,113.844161,132.27002207999999,136.51490555999999]
[null,"2023-12-05",125.35386903,123.83593844000001,114.18602839,132.33022227999999,136.58243064000001]
[null,"2023-12-06",125.33536635,123.71127622,113.77179986,132.39044996999999,136.64998922999999]
[null,"2023-12-07",125.43027917000001,123.85721307,114.07885,132.450705,136.71758116000001]
[null,"2023-12-08",125.52636346,124.03554821,114.46061760000001,132.51098752999999,136.78520659]
[null,"2023-12-11",125.56220274,124.05938682999999,114.37622214,132.57129739000001,136.85286536999999]
[null,"2023-12-12",125.65493042,124.19012284,114.44405612,132.63163474999999,136.92055766999999]
[null,"2023-12-13",126.05265933,124.84444254,115.69515849,132.69199961000001,136.98828348999999]
[null,"2023-12-14",126.11282626000001,125.01143782,116.00166981,132.75003809,137.05361264999999]
[null,"2023-12-15",126.17186484,125.10674512999999,115.97190515,132.80810194,137.11897293999999]
[null,"2023-12-18",126.28754442,125.28461479000001,116.27964858,132.86619114000001,137.18436437]
[null,"2023-12-19",126.31161530999999,125.34622756,116.36280312,132.92430587000001,137.24978709000001]
[null,"2023-12-20",126.35853872,125.3443652,116.19339952999999,132.98244595,137.31524095]
[null,"2023-12-21",126.51757038,125.57890539,116.70774238,133.04061139000001,137.38072595]
[null,"2023-12-22",126.65317659999999,125.73811442,117.01069207,133.09880236000001,137.44624227]
[null,"2023-12-25"]
[null,"2023-12-26",126.75267483,125.85911694000001,117.24126477,133.15701884000001,137.5117899]
[null,"2023-12-27",126.8743621,126.03255375000001,117.55153528,133.21526069000001,137.57736868999999]
[null,"2023-12-28",126.91998139,126.08078558,117.58645725,133.27352805999999,137.64297880000001]
[null,"2023-12-29",126.97156754,126.13341479,117.61034530000001,133.33182095000001,137.70862023000001]
[null,"2024-01-01"]
[null,"2024-01-02",126.81813044,125.91683071999999,116.88582777000001,133.39013919999999,137.77429283000001]
[null,"2024-01-03",126.95264813,126.01673083999999,117.05635727000001,133.44848296999999,137.83999675999999]
[null,"2024-01-04",126.7853563,125.69266073999999,116.25903925,133.50685227,137.90573203]
[null,"2024-01-05",126.88695923,125.8025911,116.56141381,133.56524709000001,137.97149863999999]
[null,"2024-01-08",127.03441454,126.00572355,117.10735271,133.62366759,138.03729677000001]
[null,"2024-01-09",127.02578086,125.91614979000001,116.91167170999999,133.68211362,138.10312623999999]
[null,"2024-01-10",127.00914677999999,125.87484233000001,116.71334145,133.74058517,138.16898706999999]
[null,"2024-01-11",126.99267724000001,125.85715854999999,116.48061011999999,133.79908225,138.23487925000001]
[null,"2024-01-12",127.10283301,125.99528374,116.64200243000001,133.85760500999999,138.30080296]
[null,"2024-01-15",127.20180277,126.15029816000001,116.91443356000001,133.91615329999999,138.36675803]
[null,"2024-01-16",127.06276518,125.81183307000001,116.23520696,133.97472726999999,138.43274463]
[null,"2024-01-17",127.08668418000001,125.74332448,116.01794215,134.03332677,138.49876261]
[null,"2024-01-18",127.09256066,125.74553923000001,115.84501011,134.09195195000001,138.56481212]
[null,"2024-01-19",127.21608809,125.94987836999999,116.23434313999999,134.15060281999999,138.63089318999999]
[null,"2024-01-22",127.15972796,125.87018286999999,115.93346046000001,134.20927922000001,138.69700563000001]
[null,"2024-01-23",127.35408163,126.15241345,116.49788156,134.2679813,138.76314962000001]
[null,"2024-01-24",127.31062194,126.08334739,116.23865001,134.32670906999999,138.82932517]
[null,"2024-01-25",127.45008401,126.26289124,116.50309645999999,134.38546252,138.89553228]
[null,"2024-01-26",127.5101974,126.35550266,116.61921854000001,134.44424167,138.96177094999999]
[null,"2024-01-29",127.46129983,126.32781314,116.4568592,134.50304650000001,139.02804119000001]
[null,"2024-01-30",127.44502369999999,126.20176601999999,116.06769994,134.56187718000001,139.09434317]
[null,"2024-01-31",127.65485221,126.39185046,116.38568179000001,134.62073355999999,139.16067672]
[null,"2024-02-01",127.66685542,126.49798354000001,116.47341502,134.67721695,139.22456220000001]
[null,"2024-02-02",127.61818058,126.45736696,116.31978152000001,134.73372405999999,139.28847701000001]
[null,"2024-02-05",127.64228239000001,126.49148172,116.2930439,134.79025489,139.35242117999999]
[null,"2024-02-06",127.78831275,126.78246790999999,116.90573367,134.84680942,139.41639469]
[null,"2024-02-07",127.91374048,126.95196627999999,117.21580707,134.90338765999999,139.48039754999999]
[null,"2024-02-08",127.82707092,126.78830845,116.72783708,134.95998961999999,139.54442976000001]
[null,"2024-02-09",127.88776982,126.85586477,116.76616559,135.01661529,139.60849134]
[null,"2024-02-12"]
[null,"2024-02-13"]
[null,"2024-02-14",127.77996134999999,126.63864022999999,116.2349112,135.07326466999999,139.67258226999999]
[null,"2024-02-15",127.89729034,126.82974704,116.58773447,135.12993792,139.73670274]
[null,"2024-02-16",127.99384571,126.9239219,116.83509424,135.18663488999999,139.80085256999999]
[null,"2024-02-19",128.04308219000001,126.98405585,116.89674986,135.24335572999999,139.86503193999999]
[null,"2024-02-20",128.20451564999999,127.09402342999999,117.1309194,135.30010028999999,139.92924069]
[null,"2024-02-21",128.22529890000001,127.11394645,117.05309726999999,135.35686871999999,139.99347899]
[null,"2024-02-22",128.32444665,127.38065645,117.63673498,135.41366085999999,140.05774665999999]
[null,"2024-02-23",128.34968645999999,127.35502169,117.45295993000001,135.47047688000001,140.12204388999999]
[null,"2024-02-26",128.3336497,127.28944881,117.33561201000001,135.52731678000001,140.18637067]
[null,"2024-02-27",128.55221478999999,127.57750543,117.97822828,135.58418055000001,140.25072700999999]
[null,"2024-02-28",128.5339884,127.46299163,117.59345633,135.64106820000001,140.31511291999999]
[null,"2024-02-29",128.66833649,127.59966812,117.68206535,135.69797972999999,140.37952838999999]
[null,"2024-03-01",128.75385506999999,127.72936421999999,117.90978436,135.75491513,140.44397344000001]
[null,"2024-03-04",128.68281422999999,127.57423201,117.44440744000001,135.81187439999999,140.50844805]
[null,"2024-03-05",128.82460359999999,127.64197493,117.51354024,135.86885756000001,140.57295224000001]
[null,"2024-03-06",128.86408434000001,127.75407585000001,117.64237403,135.92586459,140.63748601]
[null,"2024-03-07",128.91827735000001,127.83945586999999,117.71754136,135.98289549,140.70204935999999]
[null,"2024-03-08",129.02492591000001,127.84612172,117.71435658,136.03995044000001,140.76664246999999]
[null,"2024-03-11",129.06600374000001,127.80836354,117.47148246,136.09702926,140.83126515999999]
[null,"2024-03-12",129.19434133999999,128.09714550000001,118.04963761,136.15413196,140.89591745000001]
[null,"2024-03-13",129.30143756999999,128.1979939,118.2160605,136.2112587,140.9605995]
[null,"2024-03-14",129.26946984,128.10798715999999,118.08197939,136.26840931999999,141.02531114999999]
[null,"2024-03-15",129.22406050000001,127.93505318,117.69738851,136.32558398,141.09005257000001]
[null,"2024-03-18",129.25963877999999,128.00871753000001,117.86936934000001,136.38278267999999,141.15482377000001]
[null,"2024-03-19",129.40659170999999,128.21237965,118.19764513,136.44000542000001,141.21962474]
[null,"2024-03-20",129.62967513000001,128.53643593000001,118.87248412,136.49725203,141.28445532999999]
[null,"2024-03-21",129.59011085,128.42538762999999,118.63961397,136.55207956999999,141.34678679999999]
[null,"2024-03-22",129.56031824999999,128.35844950000001,118.37449650000001,136.60692917,141.40914581000001]
[null,"2024-03-25",129.61493035000001,128.37280806999999,118.27771758999999,136.66180084000001,141.47153236]
[null,"2024-03-26",129.62686163000001,128.34171523000001,118.19485399,136.71669456999999,141.53394646000001]
[null,"2024-03-27",129.74833849999999,128.55023159000001,118.59235692999999,136.77161036999999,141.59638812]
[null,"2024-03-28",129.83782586999999,128.68685102000001,118.87415482999999,136.82654822999999,141.65885732999999]
[null,"2024-03-29"]
[null,"2024-04-01",129.82821358000001,128.63782763,118.70135080999999,136.88150815,141.72135410000001]
[null,"2024-04-02",129.81720891000001,128.60292554,118.61832962,136.93649013999999,141.78387842999999]
[null,"2024-04-03",129.85604266000001,128.61135820999999,118.53425162000001,136.99149420000001,141.84643032]
[null,"2024-04-04",129.85342419,128.54402014999999,118.39368966000001,137.04652032000001,141.90900977999999]
[null,"2024-04-05",129.85685785000001,128.55024677,118.40094293,137.10156850999999,141.97161681]
[null,"2024-04-08",130.00148891000001,128.76315744999999,118.91390636,137.15663875999999,142.03425141]
[null,"2024-04-09",130.11727126,128.91801434999999,119.2053042,137.21173124000001,142.09691375]
[null,"2024-04-10",129.99620644000001,128.67566883999999,118.71100145,137.26684578999999,142.15960368]
[null,"2024-04-11",129.98935599999999,128.69442760999999,118.6705826,137.32198256000001,142.22232136]
[null,"2024-04-12",129.91291866,128.48303820000001,117.97215743,137.3771414,142.28506662000001]
[null,"2024-04-15",129.75702473000001,128.23085007,117.44137062999999,137.43232247,142.34783963999999]
[null,"2024-04-16",129.70303987,128.10959025,117.32340275,137.48752561000001,142.41064025]
[null,"2024-04-17",129.67367536,127.98546723,116.98322629,137.54275096999999,142.47346863000001]
[null,"2024-04-18",129.71317931999999,128.01895013999999,116.87738502000001,137.59799856999999,142.53632476999999]
[null,"2024-04-19",129.89060492999999,128.13440122,117.07840375000001,137.65326822,142.59920851000001]
[null,"2024-04-22",129.92666391,128.22604365000001,117.20045824,137.70856011000001,142.66212003000001]
[null,"2024-04-23",129.88547517999999,128.17978509,117.05044030000001,137.76387423,142.72505932000001]
[null,"2024-04-24",129.81348338999999,128.02432327,116.73848782,137.81921058,142.78802639]
[null,"2024-04-25",129.80907877000001,128.08357304,116.7845641,137.87456915999999,142.85102123999999]
[null,"2024-04-26",130.01484614,128.38763212999999,117.42918053,137.92994997,142.91404388000001]
[null,"2024-04-29",130.12682673,128.55868025000001,117.74251787,137.985353,142.97709431000001]
[null,"2024-04-30",129.99097208000001,128.24653111999999,117.20689451,138.04077827,143.04017253000001]
[null,"2024-05-01"]
[null,"2024-05-02",130.17155382000001,128.48480481000001,117.55798607,138.09622593,143.10327871000001]
[null,"2024-05-03",130.39345370999999,128.85563382000001,118.27232854,138.15169581999999,143.16641268999999]
[null,"2024-05-06",130.33333114999999,128.8012104,118.17739806,138.20718794000001,143.22957446999999]
[null,"2024-05-07",130.40364774,128.92548553,118.34024823999999,138.26270228999999,143.29276404999999]
[null,"2024-05-08",130.47197260999999,129.01023183999999,118.52784687,138.31823904000001,143.35598160999999]
[null,"2024-05-09",130.44136732000001,128.99999606,118.27383638000001,138.37255611,143.4179398]
[null,"2024-05-10",130.34266672999999,128.86783335000001,118.0070868,138.42689443,143.47992467]
[null,"2024-05-13",130.34694547999999,128.88499336999999,117.97931747,138.48125415999999,143.54193641000001]
[null,"2024-05-14",130.39807396,128.99059692,118.04839956000001,138.53563513,143.60397484000001]
[null,"2024-05-15",130.53174533999999,129.17789321999999,118.33179753,138.59003749999999,143.66604013]
[null,"2024-05-16",130.62497926,129.29666682999999,118.43850395,138.64446128,143.7281323]
[null,"2024-05-17",130.63804525,129.24343918,118.36599732000001,138.69890647,143.79025132999999]
[null,"2024-05-20",130.66720685999999,129.25016905000001,118.35619637000001,138.75337289000001,143.85239706999999]
[null,"2024-05-21",130.71977698000001,129.32272194999999,118.37680425000001,138.80786072999999,143.91456969000001]
[null,"2024-05-22",130.62469478,129.11916496000001,117.84449032000001,138.86236997,143.97676917999999]
[null,"2024-05-23",130.64453395000001,129.09760915000001,117.59499774,138.91690062000001,144.03899555999999]
[null,"2024-05-24",130.65172432,129.12530124,117.58802814000001,138.97145266999999,144.10124883]
[null,"2024-05-27",130.75082130999999,129.27283595,117.78424954,139.02602612999999,144.16352899]
[null,"2024-05-28",130.70288085999999,129.16637087000001,117.42021909,139.08062115999999,144.2258362]
[null,"2024-05-29",130.68182089999999,129.06044696000001,117.25743719,139.13523760000001,144.28817032000001]
[null,"2024-05-30"]
[null,"2024-05-31",130.80062795000001,129.18962640999999,117.29585194000001,139.18987544000001,144.35053133]
[null,"2024-06-03",130.87133623,129.24896726,117.37507103999999,139.24453468999999,144.41291924000001]
[null,"2024-06-04",130.86694467000001,129.27738871,117.33955889000001,139.29921551000001,144.47533422000001]
[null,"2024-06-05",130.83503851,129.30776299999999,117.32086549,139.35391774000001,144.53777611999999]
[null,"2024-06-06",131.00307051999999,129.53700814000001,117.76056155000001,139.40864153999999,144.60024508999999]
[null,"2024-06-07",130.75120035,129.12171529,117.10523784999999,139.46338674,144.66274096999999]
[null,"2024-06-10",130.82520767,129.25176830000001,117.15511452,139.51815350999999,144.72526395]
[null,"2024-06-11",130.96053309000001,129.44848192000001,117.54061057,139.5729417,144.78781383]
[null,"2024-06-12",130.79362042,129.23160723000001,117.13144162,139.62775145000001,144.85039082]
[null,"2024-06-13",130.79520891999999,129.22776472999999,116.85253098,139.68258277000001,144.91299488999999]
[null,"2024-06-14",130.89577374000001,129.34653562,116.9723178,139.7374355,144.97562589]
[null,"2024-06-17",130.89296243999999,129.42432517,116.97751835,139.7923098,145.038284]
[null,"2024-06-18",130.92939688000001,129.51623823,117.12284868,139.84720566999999,145.10096920999999]
[null,"2024-06-19",131.07767405000001,129.73419860999999,117.54885605,139.90212312,145.16368152000001]
[null,"2024-06-20",131.11903799999999,129.74519035,117.49684119,139.95706213,145.22642094]
[null,"2024-06-21",131.27289162,129.94460470999999,117.75242258,140.01202272,145.28918748000001]
[null,"2024-06-24",131.41700487,130.05146196999999,118.01945851000001,140.06700487000001,145.35198113000001]
[null,"2024-06-25",131.45873656000001,130.17545240999999,118.25530354,140.12200859999999,145.41480189999999]
[null,"2024-06-26",131.55182619999999,130.33373779999999,118.59534916,140.1770339,145.47764978999999]
[null,"2024-06-27",131.76977980000001,130.61214473999999,119.33040688,140.23208077000001,145.54052479999999]
[null,"2024-06-28",131.72651273,130.53387448000001,119.30134988,140.28714937000001,145.60342711000001]
[null,"2024-07-01",131.68364464000001,130.56560593,119.43860444000001,140.34223954999999,145.66635656]
[null,"2024-07-02",131.81089159999999,130.76325262,119.69219937,140.39735128999999,145.72931313000001]
[null,"2024-07-03",131.96473366999999,130.98323078000001,119.96364208,140.45248477000001,145.79229701]
[null,"2024-07-04",132.20118633999999,131.27469722999999,120.40206274000001,140.50763982999999,145.85530803]
[null,"2024-07-05",132.40347269,131.49993069999999,120.76248922000001,140.56281662000001,145.91834636999999]
[null,"2024-07-08",132.39389660000001,131.51065840000001,120.72325281000001,140.61801514000001,145.98141201000001]
[null,"2024-07-09",132.49818192000001,131.59469917999999,120.85325764,140.67323524,146.04450481000001]
[null,"2024-07-10",132.57458928,131.82685628999999,121.00217563,140.72847707,146.10762492999999]
[null,"2024-07-11",132.75577909,132.0193333,121.28400812,140.78374063000001,146.17077237000001]
[null,"2024-07-12",132.88431417000001,132.1890439,121.618049,140.83902577000001,146.23394697000001]
[null,"2024-07-15",132.93015725000001,132.23677282,121.8107395,140.89433263999999,146.2971489]
[null,"2024-07-16",132.96424754,132.27251337999999,121.74650577,140.94966124999999,146.36037816000001]
[null,"2024-07-17",133.05532887999999,132.26160455999999,121.75913228,141.00501159999999,146.42363476]
[null,"2024-07-18",132.91795734999999,132.01813225000001,121.21138231,141.06038368,146.48691869000001]
[null,"2024-07-19",132.95722537,131.99144952,121.17866701,141.11577750000001,146.55022997]
[null,"2024-07-22",133.11393907999999,132.21170506000001,121.53708777,141.17119305,146.61356860000001]
[null,"2024-07-23",132.99032887000001,131.96701672,121.03340194,141.22663033000001,146.67693456999999]
[null,"2024-07-24",133.01818177000001,131.84810479000001,120.69078807,141.28208952,146.74032807]
[null,"2024-07-25",132.95386905000001,131.65965695,120.29673384,141.33757044000001,146.80374891]
[null,"2024-07-26",133.12162172999999,131.99261218999999,120.83340027,141.39307310000001,146.86719711999999]
[null,"2024-07-29",133.02798485,131.83843486000001,120.38979823,141.44859765999999,146.93067285999999]
[null,"2024-07-30",133.09023045000001,131.7494835,120.04056387999999,141.50414395999999,146.99417595]
[null,"2024-07-31",133.27426613,132.31209870999999,121.03710397,141.55971199000001,147.05770641999999]
[null,"2024-08-01",133.33413862,132.29811430000001,120.88482620000001,141.61530192000001,147.12126441999999]
[null,"2024-08-02",133.69616927999999,132.55972935,120.92171236,141.67091375000001,147.18484996999999]
[null,"2024-08-05",133.68726770999999,132.36286608,120.35052978,141.72654732000001,147.24846289000001]
[null,"2024-08-06",133.48699812999999,132.11261994,120.13171834000001,141.78220279000001,147.31210336000001]
[null,"2024-08-07",133.65762538999999,132.27032742,120.50432927,141.83788014999999,147.37577138]
[null,"2024-08-08",133.80202753,132.61476877999999,121.13844622000001,141.89357926,147.43946679000001]
[null,"2024-08-09",133.96782102,132.92917548,121.69558619999999,141.94930026,147.50318974999999]
[null,"2024-08-12",134.00880147999999,132.99416592,121.74653821,142.00504316000001,147.56694028000001]
[null,"2024-08-13",134.12893346999999,133.30634386,122.17612333,142.06080797000001,147.63071837000001]
[null,"2024-08-14",134.14791398,133.40472718999999,122.34670564,142.11659467000001,147.69452401999999]
[null,"2024-08-15",134.23430737000001,133.62762389,122.92777099,142.17240328,147.75835724000001]
[null,"2024-08-16",134.17399273999999,133.52001584999999,122.67798227999999,142.22823378000001,147.82221804]
[null,"2024-08-19",134.37356591,133.75676611,123.29800530999999,142.28408619000001,147.88610641]
[null,"2024-08-20",134.41752482999999,133.82532721999999,123.50974895,142.33996049000001,147.95002235999999]
[null,"2024-08-21",134.49098631000001,133.92854344,123.62417696999999,142.39585686000001,148.01396606]
[null,"2024-08-22",134.39054992000001,133.76792481000001,123.19914233999999,142.45177512999999,148.07793735000001]
[null,"2024-08-23",134.66771273000001,134.06128262999999,123.71743552,142.50771531000001,148.14193621999999]
[null,"2024-08-26",134.67079398999999,134.05451740999999,123.73917632,142.56367753999999,148.20596286]
[null,"2024-08-27",134.64354183,134.02334556,123.64073535,142.61966168000001,148.27001709000001]
[null,"2024-08-28",134.61085964,133.97124231000001,123.62550353,142.67566787999999,148.33409907999999]
[null,"2024-08-29",134.61424284,133.93545626,123.44039386,142.73169598000001,148.39820868000001]
[null,"2024-08-30",134.62653047000001,133.92381277999999,123.52383616,142.78774615,148.46234605000001]
[null,"2024-09-02",134.56575255000001,133.76043741000001,123.15405022,142.84381837999999,148.52651119000001]
[null,"2024-09-03",134.58914343000001,133.58544938,122.73136289999999,142.89991251000001,148.59070395000001]
[null,"2024-09-04",134.85074517999999,133.97219365000001,123.40514856999999,142.95602871,148.65492448000001]
[null,"2024-09-05",134.88789586999999,133.99406696,123.26103929,143.01216697000001,148.71917281]
[null,"2024-09-06",134.81496561,133.72791271,122.53792693,143.06832729999999,148.78344892000001]
[null,"2024-09-09",134.83882413000001,133.78396283999999,122.55705399999999,143.12450969,148.84775282000001]
[null,"2024-09-10",134.87192163,133.88951602,122.69528919,143.18071415,148.91208451]
[null,"2024-09-11",134.97319687000001,134.10623178,123.08293024,143.23694067,148.97644400999999]
[null,"2024-09-12",134.90125519,133.95594783000001,122.83024625,143.29318925999999,149.04083130000001]
[null,"2024-09-13",135.01327151999999,134.10878941000001,123.15391212,143.34945991000001,149.1052464]
[null,"2024-09-16",134.96652111,133.94430095999999,122.8947323,143.40575262999999,149.16968929999999]
[null,"2024-09-17",134.96802779000001,133.9107995,122.76472717999999,143.46206741,149.23416001999999]
[null,"2024-09-18",134.96433683000001,133.80645138,122.38882905,143.51840442,149.29865871999999]
[null,"2024-09-19",134.70188342,133.51960600999999,121.88439461,143.57605215999999,149.36452584]
[null,"2024-09-20",134.50726460000001,133.22395972000001,121.25217261,143.63372312000001,149.43042209999999]
[null,"2024-09-23",134.5458074,133.25403374000001,121.25576344,143.69141729,149.49634746999999]
[null,"2024-09-24",134.64718672000001,133.47361132,121.53461778,143.74913468,149.56230198]

{"sheet":"Anual","index":2,"n_rows":65,"n_cols":15,"rows_kept":65,"cut":false,"hidden":false,"merged":[]}
[null,null,null,"Planilha Auxiliar Não Modificar - Percepção Anual do Retorno das Carteiras"]
[]
[null,"Código","Nome",{"$f":"'Lâmina Cart. Hip. Cons. Mod. Ag'!E2","v":"2024-09-24"},{"$f":"DATE(YEAR(D3)-1,12,31)","v":"2023-12-31"},{"$f":"DATE(YEAR(E3)-1,12,31)","v":"2022-12-31"},"2021-12-31","2020-12-31","2019-12-31","2018-12-31","2017-12-31","2016-12-31","2015-12-31"]
[null,{"$f":"'Lâmina Cart. Hip. Cons. Mod. Ag'!$E$8","v":"Conservador                                                                                                     <EcoPortfolio>{\"type\":\"P\",\"tolerance\":null,\"rebalance\":\"NO\",\"name\":\"Conservador\",\"data\":[[null,\"2024-09-24\"],[\"CDI Acumulado\",40.0],[\"IDA DI\",25.0],[\"IRF-M\",15.0],[\"IMA-B\",5.0],[\"IBXX\",0.0],[\"SMLL<xbsp>\",5.0],[\"BDRX\",0.0],[\"IFIX\",5.0],[\"DOLOF\",5.0],[\"ABEV3<XBSP>\",null],[\"BRML3<XBSP>\",null],[\"BBDC4<XBSP>\",null],[\"024813\",null],[\"267163\",null],[\"219436\",null],[\"\",null],[\"\",null],[\"\",null],[\"\",null],[\"\",null],[\"\",null],[\"\",null],[\"\",null],[\"\",null],[\"\",null],[\"\",null],[\"\",null],[\"\",null],[\"\",null],[\"\",null],[\"\",null],[\"\",null],[\"\",null],[\"\",null],[\"\",null],[\"\",null],[\"\",null],[\"\",null],[\"\",null],[\"\",null],[\"\",null],[\"\",null],[\"\",null],[\"\",null],[\"\",null],[\"\",null],[\"\",null],[\"\",null],[\"\",null],[\"\",null],[\"\",null],[\"\",null],[\"\",null],[\"\",null],[\"\",null],[\"\",null],[\"\",null],[\"\",null],[\"\",null],[\"\",null]]}"},"CONSERVADORA",{"$f":"_xll.ECONOMATICA($B$4:$B$65,\"return\",\"ytd\",D$3,,,,\"decimal\",\"false\",\"false\")","v":6.0451479928999997E-2},{"$f":"_xll.ECONOMATICA($B$4:$B$65,\"return\",\"ytd\",E$3,,,,\"decimal\",\"false\",\"false\")","v":0.12838967484},{"$f":"_xll.ECONOMATICA($B$4:$B$65,\"return\",\"ytd\",F$3,,,,\"decimal\",\"false\",\"false\")","v":8.1928088390000001E-2},{"$f":"_xll.ECONOMATICA($B$4:$B$65,\"return\",\"ytd\",G$3,,,,\"decimal\",\"false\",\"false\")","v":1.7513955304999999E-2},{"$f":"_xll.ECONOMATICA($B$4:$B$65,\"return\",\"ytd\",H$3,,,,\"decimal\",\"false\",\"false\")","v":3.5332618268999999E-2},{"$f":"_xll.ECONOMATICA($B$4:$B$65,\"return\",\"ytd\",I$3,,,,\"decimal\",\"false\",\"false\")","v":0.1263610171},{"$f":"_xll.ECONOMATICA($B$4:$B$65,\"return\",\"ytd\",J$3,,,,\"decimal\",\"false\",\"false\")","v":8.1870778998999999E-2},{"$f":"_xll.ECONOMATICA($B$4:$B$65,\"return\",\"ytd\",K$3,,,,\"decimal\",\"false\",\"false\")","v":0.13244628483000001},{"$f":"_xll.ECONOMATICA($B$4:$B$65,\"return\",\"ytd\",L$3,,,,\"decimal\",\"false\",\"false\")","v":0.15400999189},{"$f":"_xll.ECONOMATICA($B$4:$B$65,\"return\",\"ytd\",M$3,,,,\"decimal\",\"false\",\"false\")","v":0.11719304827}]
[null,{"$f":"'Lâmina Cart. Hip. Cons. Mod. Ag'!$G$8","v":"Moderada                                                                                                     <EcoPortfolio>{\"type\":\"P\",\"tolerance\":null,\"rebalance\":\"NO\",\"name\":\"Moderada\",\"data\":[[null,\"2024-09-24\"],[\"CDI Acumulado\",20.0],[\"IDA DI\",20.0],[\"IRF-M\",20.0],[\"IMA-B\",15.0],[\"IBXX\",5.0],[\"SMLL<xbsp>\",5.0],[\"BDRX\",5.0],[\"IFIX\",5.0],[\"DOLOF\",5.0],[\"ABEV3<XBSP>\",null],[\"BRML3<XBSP>\",null],[\"BBDC4<XBSP>\",null],[\"024813\",null],[\"267163\",null],[\"219436\",null],[\"\",null],[\"\",null],[\"\",null],[\"\",null],[\"\",null],[\"\",null],[\"\",null],[\"\",null],[\"\",null],[\"\",null],[\"\",null],[\"\",null],[\"\",null],[\"\",null],[\"\",null],[\"\",null],[\"\",null],[\"\",null],[\"\",null],[\"\",null],[\"\",null],[\"\",null],[\"\",null],[\"\",null],[\"\",null],[\"\",null],[\"\",null],[\"\",null],[\"\",null],[\"\",null],[\"\",null],[\"\",null],[\"\",null],[\"\",null],[\"\",null],[\"\",null],[\"\",null],[\"\",null],[\"\",null],[\"\",null],[\"\",null],[\"\",null],[\"\",null],[\"\",null]]}"},"MODERADA",5.8193909490000001E-2,0.14199379884999999,4.9811791892000003E-2,9.6912694697999999E-3,5.4695856748000003E-2,0.16881408894,9.6232303953000004E-2,0.14955420829999999,0.17092830111999999,0.10389504594,null,"← Não Modificar"]
[null,{"$f":"'Lâmina Cart. Hip. Cons. Mod. Ag'!$I$8","v":"Agressiva                                                                                                     <EcoPortfolio>{\"type\":\"P\",\"tolerance\":null,\"rebalance\":\"NO\",\"name\":\"Agressiva\",\"data\":[[null,\"2024-09-24\"],[\"CDI Acumulado\",5.0],[\"IDA DI\",5.0],[\"IRF-M\",15.0],[\"IMA-B\",10.0],[\"IBXX\",15.0],[\"SMLL<xbsp>\",15.0],[\"BDRX\",10.0],[\"IFIX\",15.0],[\"DOLOF\",10.0],[\"ABEV3<XBSP>\",null],[\"BRML3<XBSP>\",null],[\"BBDC4<XBSP>\",null],[\"024813\",null],[\"267163\",null],[\"219436\",null],[\"\",null],[\"\",null],[\"\",null],[\"\",null],[\"\",null],[\"\",null],[\"\",null],[\"\",null],[\"\",null],[\"\",null],[\"\",null],[\"\",null],[\"\",null],[\"\",null],[\"\",null],[\"\",null],[\"\",null],[\"\",null],[\"\",null],[\"\",null],[\"\",null],[\"\",null],[\"\",null],[\"\",null],[\"\",null],[\"\",null],[\"\",null],[\"\",null],[\"\",null],[\"\",null],[\"\",null],[\"\",null],[\"\",null],[\"\",null],[\"\",null],[\"\",null],[\"\",null],[\"\",null],[\"\",null],[\"\",null],[\"\",null],[\"\",null],[\"\",null],[\"\",null]]}"},"AGRESSIVA",3.3366728678000002E-2,0.14736156619999999,-2.5398281176000001E-2,-2.7265083908000001E-2,5.1792083475E-2,0.28924692853,0.10543184353,0.21253403144999999,0.18111015751000001,5.5756295522000003E-2]
[null,{"$f":"IF('Lâmina Cart. Hip. Cons. Mod. Ag'!D11=\"\",\"\",'Lâmina Cart. Hip. Cons. Mod. Ag'!D11)","v":"CDI Acumulado"},{"$f":"_xll.ECONOMATICA($B$7:$B$65,\"Name\",,,,,,,\"FALSE\",\"FALSE\")","v":"CDI"},7.8130739214000003E-2,0.13039474929,0.12391019239999999,4.4236266726999998E-2,2.7578158110999999E-2,5.9598836335000002E-2,6.4213544344999998E-2,9.9254731575000005E-2,0.13999176716,0.13239194386]
[null,{"$f":"IF('Lâmina Cart. Hip. Cons. Mod. Ag'!D12=\"\",\"\",'Lâmina Cart. Hip. Cons. Mod. Ag'!D12)","v":"IDA DI"},"Ida DI",0.1034230183,0.12711073579000001,0.14562793867000001,7.5814468245999994E-2,2.1441512312000002E-2,5.5930046454000001E-2,7.3882481240000006E-2,0.11564307425000001,0.15751134674,0.14113721473999999]
[null,{"$f":"IF('Lâmina Cart. Hip. Cons. Mod. Ag'!D13=\"\",\"\",'Lâmina Cart. Hip. Cons. Mod. Ag'!D13)","v":"IRF-M"},"Ind RF-M Tot",3.9993610173000002E-2,0.16509056248000001,8.8247019412E-2,-1.9922432239999999E-2,6.6946328425000007E-2,0.12030170187,0.10732164978,0.15198352550999999,0.23371325078999999,7.1250372007999996E-2]
[null,{"$f":"IF('Lâmina Cart. Hip. Cons. Mod. Ag'!D14=\"\",\"\",'Lâmina Cart. Hip. Cons. Mod. Ag'!D14)","v":"IMA-B"},"Ima-B Tot",1.0025011375E-2,0.16054306708999999,6.3692259794999997E-2,-1.2642482302E-2,6.4056041667000005E-2,0.22950364609000001,0.13058738172000001,0.12794069236,0.24810603514999999,8.8815324614000005E-2]
[null,{"$f":"IF('Lâmina Cart. Hip. Cons. Mod. Ag'!D15=\"\",\"\",'Lâmina Cart. Hip. Cons. Mod. Ag'!D15)","v":"IBXX"},"Ibrx Brasil",-9.9437338995000003E-3,0.21274740375000001,4.0164193793E-2,-0.11174726291000001,3.5005142225000001E-2,0.33388633988999999,0.15420767966000001,0.27545586574000003,0.36701042298999997,-0.1240942904]
[null,{"$f":"IF('Lâmina Cart. Hip. Cons. Mod. Ag'!D16=\"\",\"\",'Lâmina Cart. Hip. Cons. Mod. Ag'!D16)","v":"SMLL<xbsp>"},"Small Cap",-0.12751914592999999,0.17119619321000001,-0.15059782517,-0.16197265438,-6.5400197809000003E-3,0.58197278153999998,8.1290679961999998E-2,0.49355215826999999,0.31753554501999998,-0.22355105795999999]
[null,{"$f":"IF('Lâmina Cart. Hip. Cons. Mod. Ag'!D17=\"\",\"\",'Lâmina Cart. Hip. Cons. Mod. Ag'!D17)","v":"BDRX"},"Bdrx",0.41865099517999999,0.26333491471999998,-0.28053589958000003,0.33652056493999999,0.54008861744000003,0.35666342897999997,0.12021907934000001,0.24071158212999999,-9.7060833902999993E-2,0.52290076336000002]
[null,{"$f":"IF('Lâmina Cart. Hip. Cons. Mod. Ag'!D18=\"\",\"\",'Lâmina Cart. Hip. Cons. Mod. Ag'!D18)","v":"IFIX"},"Ind Fdo Imob",-2.3856762782000001E-3,0.15496332568999999,2.2226262928999999E-2,-2.2772328971999999E-2,-0.10239931448,0.35975233777999999,5.6201324073999998E-2,0.19445278969999999,0.32292405961999998,5.4640718562999999E-2]
[null,{"$f":"IF('Lâmina Cart. Hip. Cons. Mod. Ag'!D19=\"\",\"\",'Lâmina Cart. Hip. Cons. Mod. Ag'!D19)","v":"DOLOF"},"Dolar Ptax Venda",0.12990312519,-7.2139065104999997E-2,-6.5012095689999994E-2,7.3854561548000006E-2,0.28927977771000002,4.0234334676000003E-2,0.17134220073,1.5004142247E-2,-0.16536058184999999,0.47007002484999999]
[null,{"$f":"IF('Lâmina Cart. Hip. Cons. Mod. Ag'!D20=\"\",\"\",'Lâmina Cart. Hip. Cons. Mod. Ag'!D20)","v":"ABEV3<XBSP>"},"Ambev S/A",-7.0648215587000004E-2,-4.9817025611E-3,-8.7512531927000006E-3,2.8635677389000001E-2,-0.13959304602,0.24579669156,-0.25365316285,0.33412877546000003,-4.7741452126999998E-2,0.13651612988]
[null,{"$f":"IF('Lâmina Cart. Hip. Cons. Mod. Ag'!D21=\"\",\"\",'Lâmina Cart. Hip. Cons. Mod. Ag'!D21)","v":"BRML3<XBSP>"},"BR Malls Par",null,null,4.4710416314000002E-3,-0.16060606060999999,-0.45182724252000001,0.47753104831999998,3.4689092138999997E-2,0.23086458787,0.39954954954999999,-0.30501304181]
[null,{"$f":"IF('Lâmina Cart. Hip. Cons. Mod. Ag'!D22=\"\",\"\",'Lâmina Cart. Hip. Cons. Mod. Ag'!D22)","v":"BBDC4<XBSP>"},"Bradesco",-0.12329445046,0.25648371255000002,-0.11294160421,-0.18655102067000001,-0.15215593117000001,0.18869368026,0.29886839549999999,0.33457329527000002,0.73700888462000003,-0.29516927393999998]
[null,{"$f":"IF('Lâmina Cart. Hip. Cons. Mod. Ag'!D23=\"\",\"\",'Lâmina Cart. Hip. Cons. Mod. Ag'!D23)","v":"024813"},"Fama Fc FIA",-0.11872809652999999,9.0358180327000007E-2,-0.21163648765000001,-0.22345745439,2.4653843995000001E-2,0.41552706342000001,0.10032509214,0.45030668741000002,0.55240778748999997,-0.31269386793999998]
[null,{"$f":"IF('Lâmina Cart. Hip. Cons. Mod. Ag'!D24=\"\",\"\",'Lâmina Cart. Hip. Cons. Mod. Ag'!D24)","v":"267163"},"Alaska Black FIC FIA Bdr Nivel I",-0.35943297803000002,0.58741959998000004,9.0991394697999994E-2,-0.18169247416000001,-0.45376730640000001,0.36481571786,0.30370689887000002,0.74617918080000001,1.2920855516,-0.22368636461999999]
[null,{"$f":"IF('Lâmina Cart. Hip. Cons. Mod. Ag'!D25=\"\",\"\",'Lâmina Cart. Hip. Cons. Mod. Ag'!D25)","v":"219436"},"Brasil Capital Fc FIA",-9.4392958671999996E-2,0.30826731624999998,-5.2637814838999999E-2,-0.19627287340999999,1.8668313733E-2,0.56152552181000004,0.12192594755,0.34549128328000001,0.36617998739000002,-6.5508996067999994E-2]
[null,{"$f":"IF('Lâmina Cart. Hip. Cons. Mod. Ag'!D26=\"\",\"\",'Lâmina Cart. Hip. Cons. Mod. Ag'!D26)","v":""}]
[null,{"$f":"IF('Lâmina Cart. Hip. Cons. Mod. Ag'!D27=\"\",\"\",'Lâmina Cart. Hip. Cons. Mod. Ag'!D27)","v":""}]
[null,{"$f":"IF('Lâmina Cart. Hip. Cons. Mod. Ag'!D28=\"\",\"\",'Lâmina Cart. Hip. Cons. Mod. Ag'!D28)","v":""}]
[null,{"$f":"IF('Lâmina Cart. Hip. Cons. Mod. Ag'!D29=\"\",\"\",'Lâmina Cart. Hip. Cons. Mod. Ag'!D29)","v":""}]
[null,{"$f":"IF('Lâmina Cart. Hip. Cons. Mod. Ag'!D30=\"\",\"\",'Lâmina Cart. Hip. Cons. Mod. Ag'!D30)","v":""}]
[null,{"$f":"IF('Lâmina Cart. Hip. Cons. Mod. Ag'!D31=\"\",\"\",'Lâmina Cart. Hip. Cons. Mod. Ag'!D31)","v":""}]
[null,{"$f":"IF('Lâmina Cart. Hip. Cons. Mod. Ag'!D32=\"\",\"\",'Lâmina Cart. Hip. Cons. Mod. Ag'!D32)","v":""}]
[null,{"$f":"IF('Lâmina Cart. Hip. Cons. Mod. Ag'!D33=\"\",\"\",'Lâmina Cart. Hip. Cons. Mod. Ag'!D33)","v":""}]
[null,{"$f":"IF('Lâmina Cart. Hip. Cons. Mod. Ag'!D34=\"\",\"\",'Lâmina Cart. Hip. Cons. Mod. Ag'!D34)","v":""}]
[null,{"$f":"IF('Lâmina Cart. Hip. Cons. Mod. Ag'!D35=\"\",\"\",'Lâmina Cart. Hip. Cons. Mod. Ag'!D35)","v":""}]
[null,{"$f":"IF('Lâmina Cart. Hip. Cons. Mod. Ag'!D36=\"\",\"\",'Lâmina Cart. Hip. Cons. Mod. Ag'!D36)","v":""}]
[null,{"$f":"IF('Lâmina Cart. Hip. Cons. Mod. Ag'!D37=\"\",\"\",'Lâmina Cart. Hip. Cons. Mod. Ag'!D37)","v":""}]
[null,{"$f":"IF('Lâmina Cart. Hip. Cons. Mod. Ag'!D38=\"\",\"\",'Lâmina Cart. Hip. Cons. Mod. Ag'!D38)","v":""}]
[null,{"$f":"IF('Lâmina Cart. Hip. Cons. Mod. Ag'!D39=\"\",\"\",'Lâmina Cart. Hip. Cons. Mod. Ag'!D39)","v":""}]
[null,{"$f":"IF('Lâmina Cart. Hip. Cons. Mod. Ag'!D40=\"\",\"\",'Lâmina Cart. Hip. Cons. Mod. Ag'!D40)","v":""}]
[null,{"$f":"IF('Lâmina Cart. Hip. Cons. Mod. Ag'!D41=\"\",\"\",'Lâmina Cart. Hip. Cons. Mod. Ag'!D41)","v":""}]
[null,{"$f":"IF('Lâmina Cart. Hip. Cons. Mod. Ag'!D42=\"\",\"\",'Lâmina Cart. Hip. Cons. Mod. Ag'!D42)","v":""}]
[null,{"$f":"IF('Lâmina Cart. Hip. Cons. Mod. Ag'!D43=\"\",\"\",'Lâmina Cart. Hip. Cons. Mod. Ag'!D43)","v":""}]
[null,{"$f":"IF('Lâmina Cart. Hip. Cons. Mod. Ag'!D44=\"\",\"\",'Lâmina Cart. Hip. Cons. Mod. Ag'!D44)","v":""}]
[null,{"$f":"IF('Lâmina Cart. Hip. Cons. Mod. Ag'!D45=\"\",\"\",'Lâmina Cart. Hip. Cons. Mod. Ag'!D45)","v":""}]
[null,{"$f":"IF('Lâmina Cart. Hip. Cons. Mod. Ag'!D46=\"\",\"\",'Lâmina Cart. Hip. Cons. Mod. Ag'!D46)","v":""}]
[null,{"$f":"IF('Lâmina Cart. Hip. Cons. Mod. Ag'!D47=\"\",\"\",'Lâmina Cart. Hip. Cons. Mod. Ag'!D47)","v":""}]
[null,{"$f":"IF('Lâmina Cart. Hip. Cons. Mod. Ag'!D48=\"\",\"\",'Lâmina Cart. Hip. Cons. Mod. Ag'!D48)","v":""}]
[null,{"$f":"IF('Lâmina Cart. Hip. Cons. Mod. Ag'!D49=\"\",\"\",'Lâmina Cart. Hip. Cons. Mod. Ag'!D49)","v":""}]
[null,{"$f":"IF('Lâmina Cart. Hip. Cons. Mod. Ag'!D50=\"\",\"\",'Lâmina Cart. Hip. Cons. Mod. Ag'!D50)","v":""}]
[null,{"$f":"IF('Lâmina Cart. Hip. Cons. Mod. Ag'!D51=\"\",\"\",'Lâmina Cart. Hip. Cons. Mod. Ag'!D51)","v":""}]
[null,{"$f":"IF('Lâmina Cart. Hip. Cons. Mod. Ag'!D52=\"\",\"\",'Lâmina Cart. Hip. Cons. Mod. Ag'!D52)","v":""}]
[null,{"$f":"IF('Lâmina Cart. Hip. Cons. Mod. Ag'!D53=\"\",\"\",'Lâmina Cart. Hip. Cons. Mod. Ag'!D53)","v":""}]
[null,{"$f":"IF('Lâmina Cart. Hip. Cons. Mod. Ag'!D54=\"\",\"\",'Lâmina Cart. Hip. Cons. Mod. Ag'!D54)","v":""}]
[null,{"$f":"IF('Lâmina Cart. Hip. Cons. Mod. Ag'!D55=\"\",\"\",'Lâmina Cart. Hip. Cons. Mod. Ag'!D55)","v":""}]
[null,{"$f":"IF('Lâmina Cart. Hip. Cons. Mod. Ag'!D56=\"\",\"\",'Lâmina Cart. Hip. Cons. Mod. Ag'!D56)","v":""}]
[null,{"$f":"IF('Lâmina Cart. Hip. Cons. Mod. Ag'!D57=\"\",\"\",'Lâmina Cart. Hip. Cons. Mod. Ag'!D57)","v":""}]
[null,{"$f":"IF('Lâmina Cart. Hip. Cons. Mod. Ag'!D58=\"\",\"\",'Lâmina Cart. Hip. Cons. Mod. Ag'!D58)","v":""}]
[null,{"$f":"IF('Lâmina Cart. Hip. Cons. Mod. Ag'!D59=\"\",\"\",'Lâmina Cart. Hip. Cons. Mod. Ag'!D59)","v":""}]
[null,{"$f":"IF('Lâmina Cart. Hip. Cons. Mod. Ag'!D60=\"\",\"\",'Lâmina Cart. Hip. Cons. Mod. Ag'!D60)","v":""}]
[null,{"$f":"IF('Lâmina Cart. Hip. Cons. Mod. Ag'!D61=\"\",\"\",'Lâmina Cart. Hip. Cons. Mod. Ag'!D61)","v":""}]
[null,{"$f":"IF('Lâmina Cart. Hip. Cons. Mod. Ag'!D62=\"\",\"\",'Lâmina Cart. Hip. Cons. Mod. Ag'!D62)","v":""}]
[null,{"$f":"IF('Lâmina Cart. Hip. Cons. Mod. Ag'!D63=\"\",\"\",'Lâmina Cart. Hip. Cons. Mod. Ag'!D63)","v":""}]
[null,{"$f":"IF('Lâmina Cart. Hip. Cons. Mod. Ag'!D64=\"\",\"\",'Lâmina Cart. Hip. Cons. Mod. Ag'!D64)","v":""}]
[null,{"$f":"IF('Lâmina Cart. Hip. Cons. Mod. Ag'!D65=\"\",\"\",'Lâmina Cart. Hip. Cons. Mod. Ag'!D65)","v":""}]
[null,{"$f":"IF('Lâmina Cart. Hip. Cons. Mod. Ag'!D66=\"\",\"\",'Lâmina Cart. Hip. Cons. Mod. Ag'!D66)","v":""}]
[null,{"$f":"IF('Lâmina Cart. Hip. Cons. Mod. Ag'!D67=\"\",\"\",'Lâmina Cart. Hip. Cons. Mod. Ag'!D67)","v":""}]
[null,{"$f":"IF('Lâmina Cart. Hip. Cons. Mod. Ag'!D68=\"\",\"\",'Lâmina Cart. Hip. Cons. Mod. Ag'!D68)","v":""}]
[null,{"$f":"IF('Lâmina Cart. Hip. Cons. Mod. Ag'!D69=\"\",\"\",'Lâmina Cart. Hip. Cons. Mod. Ag'!D69)","v":""}]