{"text_format":"1","workbook":"xlsx","n_sheets":4,"sheets":["Lâmina Debêntures IPCA-Spread","Dados para Lâmina","Base Gráfico","Base"],"not_rendered":{"charts":4,"images":1,"macros":1,"external_links":0,"defined_names":27,"comments":0,"pivot_tables":0},"unopened":[],"bounds":{"document_bytes":16777216,"sheet_cells":100000,"rows_first":2000,"rows_last":500,"rows_between":2000,"halvings":0,"cell_chars":16384,"cell_head_chars":4096},"cells_cut":0,"cells_raw":0,"read":"whole","date_system":"1900"}

{"sheet":"Lâmina Debêntures IPCA-Spread","index":0,"n_rows":61,"n_cols":17,"rows_kept":61,"cut":false,"hidden":false,"merged":[[47,2,47,3],[47,4,47,5],[47,8,47,9],[47,6,47,7],[12,10,12,11],[13,4,13,5],[14,10,14,11],[18,21,18,22],[9,2,9,5],[6,2,6,5],[7,4,7,5],[8,4,8,5]]}
[" ",null,null,null,"Lâmina Debêntures IPCA-Spread"]
[null,"Dta. Últ. Cot.: ",{"$f":"IF(C3=\"\",_xll.ECONOMATICA(\"IDA Geral\",\"Date of Last Quote\"),C3)","v":"2024-09-17"},"← Não Modificar"]
[null,"Dta. Pref. Últ. Cot.: ",null,"← Para alterar a data da Célula C2, basta digitar na Célula C3"]
[]
[null,"DADOS GERAIS",null,null,null,null,null,"CARACTERISTICAS DA EMISSÃO"]
[null,"Código",null,null," Selecione ou digite o cógido →","AEGP23",null,"Classe da debênture",null,null,null,{"$f":"IFERROR(_xll.ECONOMATICA($F$6,\"Classe da debênture\"),\"\")","v":"Simples"},null,"Vencimento/ Repactuação",null,null,{"$f":"IFERROR(_xll.ECONOMATICA($F$6,\"Vencimento/ Repactuação\"),\"\")","v":"2025-07-15"}]
[null,"Nome",{"$f":"IFERROR(_xll.ECONOMATICA($F$6,\"name\"),\"\")","v":"Aegea Saneamento e Part S/A"},null,null,null,null,"Espécie",null,null,null,{"$f":"IFERROR(_xll.ECONOMATICA($F$6,\"Espécie\"),\"\")","v":"Quirografária"},null,"Referência NTN-B",null,null,{"$f":"IFERROR(_xll.ECONOMATICA($F$6,\"Referência NTN-B\"),\"\")","v":"2025-05-15"}]
[null,"CNPJ",null,null,{"$f":"IFERROR(TEXT(_xll.ECONOMATICA($F$6,\"Employer ID number\"),\"000.000.000.0000-00\"),\"\")","v":"008.827.501.000.1-58"},null,null,"Incentivada (Lei 12.431)",null,null,null,{"$f":"IFERROR(_xll.ECONOMATICA($F$6,\"Incentivada (Lei 12.431)\"),\"\")","v":"Não"},null,"Data da Última Cotação",null,null,{"$f":"IFERROR(_xll.ECONOMATICA($F$6,\"Date of Last Quote\"),\"\")","v":"2024-09-17"}]
[null,"ISIN",null,null,{"$f":"IFERROR(_xll.ECONOMATICA($F$6,\"ISIN\"),\"\")","v":"BRAEGPDBS038"},null,null,"Tipo de debênture",null,null,null,{"$f":"IFERROR(_xll.ECONOMATICA($F$6,\"Tipo de debênture\"),\"\")","v":"IPCA Spread"},null,"PU",null,null,{"$f":"IFERROR(_xll.ECONOMATICA($F$6,\"Price\",,$C$2),\"\")","v":6854.0783780000002}]
[null,"Setor NAICS",{"$f":"IFERROR(LEFT(_xll.ECONOMATICA($F$6,\"Sector NAICS\"),50),\"\")","v":"Água, esgoto e outros sistemas"},null,null,null,null,"Índice de correção",null,null,null,{"$f":"IFERROR(_xll.ECONOMATICA($F$6,\"Índice de correção\"),\"\")","v":"IPCA + 7,0825%"},null,"% PU Par",null,null,{"$f":"IFERROR(_xll.ECONOMATICA($F$6,\"% PU Par\",,$C$2),\"\")","v":98.12}]
[null,"Agente fiduciário",null,null,null,{"$f":"IFERROR(_xll.ECONOMATICA($F$6,\"Agente fiduciário\"),\"\")","v":"Pentagono SA Dtvm"},null,"Data de emissão",null,null,null,{"$f":"IFERROR(_xll.ECONOMATICA($F$6,\"Issue date\"),\"\")","v":"2018-07-15"},null,"% Taxa (YTM)",null,null,{"$f":"IFERROR(_xll.ECONOMATICA($F$6,\"YTM\",,$C$2),\"\")","v":9.6096000000000004}]
[null,"Banco mandatário",null,null,null,{"$f":"IFERROR(_xll.ECONOMATICA($F$6,\"Banco mandatário\"),\"\")","v":"Itau Unibanco SA"},null,"Data de Ínicio da Série:",null,null,null,{"$f":"IFERROR(_xll.ECONOMATICA($F$6,\"Series Start Date\"),\"\")","v":"2020-06-24"},null,"Desvio Padrão da Taxa (YTM)",null,null,{"$f":"IFERROR(_xll.ECONOMATICA($F$6,\"Standard deviation\",,$C$2),\"\")","v":0.12}]
[null,"Líder",null,null,null,{"$f":"IFERROR(_xll.ECONOMATICA($F$6,\"Líder\"),\"\")","v":"Banco BTG Pactual SA"},null,"Quantidade",null,null,{"$f":"IFERROR(_xll.ECONOMATICA($F$6,\"Quantidade\"),\"\")","v":6650},null,null,"Duration (DU)",null,null,{"$f":"IFERROR(_xll.ECONOMATICA($F$6,\"Duration (BD)\",,$C$2),\"\")","v":205}]
[null,"Número de emissão",null,null,{"$f":"IFERROR(_xll.ECONOMATICA($F$6,\"Número de emissão\"),\"\")","v":3},null,null,"Valor Nominal",null,null,null,{"$f":"IFERROR(_xll.ECONOMATICA($F$6,\"Par value\"),\"\")","v":10000},null,"Taxa de compra",null,null,{"$f":"IFERROR(_xll.ECONOMATICA($F$6,\"Buying rate\",,$C$2),\"\")","v":9.7949999999999999}]
[null,"Nº das Série",null,null,null,{"$f":"IFERROR(_xll.ECONOMATICA($F$6,\"Series\"),\"\")","v":"02"},null,"Volume da Emissão",null,null,{"$f":"IFERROR(_xll.ECONOMATICA($F$6,\"Amount issued\"),\"\")","v":66500000},null,null,"Taxa de venda",null,null,{"$f":"IFERROR(_xll.ECONOMATICA($F$6,\"Selling rate\",,$C$2),\"\")","v":""}]
[]
[null,"PU MERCADO x PU CURVA",null,null,null,null,null,null,"PERFIL DE RETORNO (ÚLTIMOS 12M)",null,null,null,null,"PERFIL DE RISCO (ÚLTIMOS 12M)"]
[null,null,null,null,null,null,null,null,"Meses Positivos",null,null,{"$f":"IFERROR(_xll.ECONOMATICA($F$6,\"Number Return\",\"12M\",$C$2,,,,,,,,{\"std.tec.dret.noprc=true\"}),\"\")","v":12},null,"Volatilidade",null,null,{"$f":"IFERROR(_xll.ECONOMATICA($F$6,\"Volatility\",\"12M\",$C$2),\"\")","v":1.2456551167000001}]
[null,null,null,null,null,null,null,null,"Meses Negativos",null,null,{"$f":"IFERROR(_xll.ECONOMATICA($F$6,\"Number Return\",\"12M\",$C$2,,,,,,,,{\"std.tec.dret.cmp=-1\";\"std.tec.dret.noprc=true\"}),\"\")","v":0},null,"Sharpe",null,null,{"$f":"IFERROR(_xll.ECONOMATICA($F$6,\"Sharpe\",\"12M\",$C$2),\"\")","v":1.9542076945}]
[null,null,null,null,null,null,null,null,"Meses Acima do CDI",null,null,{"$f":"IFERROR(_xll.ECONOMATICA($F$6,\"Number Premium\",\"12M\",$C$2,,,,,,,,{\"std.tec.dret.noprc=true\"}),\"\")","v":9},null,"Sharpe - 36 meses",null,null,{"$f":"IFERROR(_xll.ECONOMATICA($F$6,\"Sharpe\",\"36M\",$C$2),\"\")","v":3.9489551582000001E-2}]
[null,null,null,null,null,null,null,null,"Meses Abaixo do CDI",null,null,{"$f":"IFERROR(_xll.ECONOMATICA($F$6,\"Number Premium\",\"12M\",$C$2,,,,,,,,{\"std.tec.dret.cmp=-1\";\"std.tec.dret.noprc=true\"}),\"\")","v":3},null,"VAR de 1 mês - 95% (%)",null,null,{"$f":"IFERROR(_xll.ECONOMATICA($F$6,\"VAR %\",\"1M\",$C$2,,,,\"DECIMAL\"),\"\")","v":1.5975773788999999E-3}]
[null,null,null,null,null,null,null,null,"Maior Retorno Mensal",null,null,{"$f":"IFERROR(_xll.ECONOMATICA($F$6,\"Return M\",\"12M\",$C$2,,,,\"decimal\"),\"\")","v":1.5973510379000001E-2},null,"VAR de 12 meses - 95% (%)",null,null,{"$f":"IFERROR(_xll.ECONOMATICA($F$6,\"VAR %\",\"12M\",$C$2,,,,\"DECIMAL\"),\"\")","v":1.2881956397E-3}]
[null,null,null,null,null,null,null,null,"Menor Retorno Mensal",null,null,{"$f":"IFERROR(_xll.ECONOMATICA($F$6,\"Return M\",\"12M\",$C$2,,,,\"decimal\",,,,{\"std.tec.dret.mom=true\"}),\"\")","v":5.7901940926999998E-3},null,"Perda Máxima (%)",null,null,{"$f":"IFERROR(_xll.ECONOMATICA($F$6,\"MaxLoss\",\"12M\",$C$2,,,,\"DECIMAL\"),\"\")","v":-3.3097469255000001E-3}]
[null,null,null,null,null,null,null,null,"Retorno Acumulado (%)",null,null,{"$f":"IFERROR(N29,\"\")","v":0.13882029666000001},null,"Máximo Drawdown",null,null,{"$f":"IFERROR(_xll.ECONOMATICA($F$6,\"MaxDrawdown\",\"12M\",$C$2,,,,\"DECIMAL\"),\"\")","v":-3.3097469255000001E-3}]
[null,null,null,null,null,null,null,null,"Retorno Acumulado (% CDI)",null,null,{"$f":"IFERROR(N30,\"\")","v":1.2419439393121781},null,"Alfa vs. CDI",null,null,{"$f":"IFERROR(_xll.ECONOMATICA($F$6,\"Alpha\",\"12M\",$C$2,,,,,,,,{\"std.tec.stt.rf=0:4924,1:2288,2:78983,3:3422,4:13817,5:0,6:0,7:0,8:0,9:0,10:9605,11:16733,12:0,13:0,14:0,15:0,16:0,17:0,18:0,19:0,20:0,21:0,22:0,23:0,24:0,25:0,26:0,27:0,28:0,29:0,30:0,31:0\";\"std.tec.stt.rf=,32:0,33:0,34:0,35:0,36:0,37:0,38:0,39:0,40:0,41:0,42:0,43:0,44:0,45:0,46:0,47:0,48:0,49:0,50:0,51:0,52:0,53:0,54:0,55:0,56:0,57:0,58:0,59:0,60:0,61:0,62:0,63:0,64:0,65:0,66:0,67:0,68:0,69:0,70:0,71:0,72:0,73:0,74:0,75:0,76:0,77:0,78:0,79:0\"}),\"\")","v":2.5568521345000002}]
[]
[null,{"$f":"\"RENTABILIDADE - até \"&TEXT(C2,\"DD-MM-AA\")","v":"RENTABILIDADE - até 17-09-24"}]
[null,"Item",{"$f":"EOMONTH(D28,-1)","v":"2024-04-30"},{"$f":"EOMONTH(E28,-1)","v":"2024-05-31"},{"$f":"EOMONTH(F28,-1)","v":"2024-06-30"},{"$f":"EOMONTH(H28,-1)","v":"2024-07-31"},null,{"$f":"EOMONTH(I28,-1)","v":"2024-08-31"},{"$f":"C2","v":"2024-09-17"},{"$f":"DATE(YEAR($C$2)-2,12,31)","v":"2022-12-31"},{"$f":"DATE(YEAR($C$2)-1,12,31)","v":"2023-12-31"},{"$f":"C2","v":"2024-09-17"},null,"12M","24M","36M","do início"]
[null,"Título",{"$f":"IFERROR(_xll.ECONOMATICA($F$6,\"return\",\"MTD\",C$28,,,,\"decimal\"),\"\")","v":5.7901940926999998E-3},{"$f":"IFERROR(_xll.ECONOMATICA($F$6,\"return\",\"MTD\",D$28,,,,\"decimal\"),\"\")","v":1.2285533461E-2},{"$f":"IFERROR(_xll.ECONOMATICA($F$6,\"return\",\"MTD\",E$28,,,,\"decimal\"),\"\")","v":1.0615798413E-2},{"$f":"IFERROR(_xll.ECONOMATICA($F$6,\"return\",\"MTD\",F$28,,,,\"decimal\"),\"\")","v":1.5973510379000001E-2},null,{"$f":"IFERROR(_xll.ECONOMATICA($F$6,\"return\",\"MTD\",H$28,,,,\"decimal\"),\"\")","v":6.6500890553000003E-3},{"$f":"IFERROR(_xll.ECONOMATICA($F$6,\"return\",\"MTD\",I$28,,,,\"decimal\"),\"\")","v":7.8299851175000004E-3},{"$f":"IFERROR(_xll.ECONOMATICA($F$6,\"return\",\"YTD\",J$28,,,,\"decimal\"),\"\")","v":9.2422345466000005E-2},{"$f":"IFERROR(_xll.ECONOMATICA($F$6,\"return\",\"YTD\",K$28,,,,\"decimal\"),\"\")","v":0.12124736261000001},{"$f":"IFERROR(_xll.ECONOMATICA($F$6,\"return\",\"YTD\",L$28,,,,\"decimal\"),\"\")","v":9.8389402242999996E-2},null,{"$f":"IFERROR(_xll.ECONOMATICA($F$6,\"return\",N$28,$C$2,,,,\"decimal\"),\"\")","v":0.13882029666000001},{"$f":"IFERROR(_xll.ECONOMATICA($F$6,\"return\",O$28,$C$2,,,,\"decimal\"),\"\")","v":0.25783859522000002},{"$f":"IFERROR(_xll.ECONOMATICA($F$6,\"return\",P$28,$C$2,,,,\"decimal\"),\"\")","v":0.39814113301999998},{"$f":"IFERROR(_xll.ECONOMATICA($F$6,\"return\",\"FROM START\",$C$2,,,,\"decimal\"),\"\")","v":0.62483013940999999}]
[null,"% do CDI",{"$f":"IFERROR(C29/C31,\"\")","v":0.65247296096565521},{"$f":"IFERROR(D29/D31,\"\")","v":1.4758583030165442},1.3466205824083783,1.7609178548028841,"",0.76657858644423649,1.6580018923930031,0.74588170412686738,0.9298485044082867,1.2949771964117671,"",1.2419439393121781,0.98574514796179535,1.007614450044549,1.0427079355866173]
{"$rows_left_out":32}
{"sheet":"Dados para Lâmina","index":1,"n_rows":701,"n_cols":6,"rows_kept":701,"cut":false,"hidden":true,"merged":[]}
[{"$f":"#REF!","v":{"$error":"#REF!"}}]
[{"$f":"INDEX(#REF!,MATCH('Dados para Lâmina'!A1,#REF!,0))","v":{"$error":"#REF!"}},null,"Ínicio",{"$f":"WORKDAY.INTL(DATE(YEAR($D$3)-#REF!,12,31),2,1,)","v":{"$error":"#REF!"}}]
[null,null,"Final",{"$f":"#REF!","v":{"$error":"#REF!"}}]
[]
[null,null,null,"Max",{"$f":"ROUNDUP(MAX($D$8:$F$5000),-1)","v":{"$error":"#VALUE!"}},{"$f":"AtualizarLimitesGrafico(\"Factsheet\",\"Base100\",E6,E5)","v":{"$error":"#VALUE!"}}]
[null,null,null,"Min",{"$f":"ROUNDDOWN(MIN($D$8:$F$5000),-1)","v":{"$error":"#VALUE!"}}]
[null,null,null,{"$f":"#REF!","v":{"$error":"#REF!"}},"IBOV","CDI"]
[null,null,{"$f":"_xll.ECONOMATICA(D7,\"close\",,D3,D2,\"d\",,,\"true\",\"false\",,{\"def.defdef=7\"})","v":{"$error":"#VALUE!"}},100,{"$f":"_xll.ECONOMATICA(E7,\"close\",,D3,D2,\"d\",,,\"false\",\"false\",,{\"def.defdef=7\"})","v":{"$error":"#VALUE!"}},{"$f":"_xll.ECONOMATICA(\"CDI Acumulado\",\"close\",,D3,D2,\"d\",,,\"false\",\"false\",,{\"def.defdef=7\"})","v":{"$error":"#VALUE!"}}]
[null,null,"2016-01-05",102.295652174042,100.65969008801,100.052496069227]
[null,null,"2016-01-06",101.56521739135501,99.126741178450203,100.105019721668]
[null,null,"2016-01-07",97.478260869625998,96.566289361915594,100.15757095709]
[null,null,"2016-01-08",99.043478260980905,96.371704515768201,100.210149775376]
[null,null,"2016-01-11",96.434782608761495,94.800787831307403,100.262756176642]
[null,null,"2016-01-12",97.113043478340799,93.763792980695101,100.31539016077301]
[null,null,"2016-01-13",95.669565217453098,92.413563987589399,100.36805196572099]
[null,null,"2016-01-14",97.686956521822097,93.732944163610199,100.42074135365]
[null,null,"2016-01-15",97.043478260980905,91.523694264469697,100.473458324443]
[null,null,"2016-01-18",94.521739130374002,90.023967157932901,100.526203116053]
[null,null,"2016-01-19",95.130434782709898,90.308725469280006,100.578975490527]
[null,null,"2016-01-20",95.269565217546202,89.331055266899099,100.63177568581899]
[null,null,"2016-01-21",95.895652174018295,89.501910253660796,100.684568509809]
[null,null,"2016-01-22",99.617391304462203,90.247027835110202,100.73738891666299]
[null,null,"2016-01-25",null,null,100.790237144334]
[null,null,"2016-01-26",96.278260869672494,88.979853349505007,100.843113192823]
[null,null,"2016-01-27",99.426086956635103,91.065707980305902,100.896016824059]
[null,null,"2016-01-28",100.243478260934,91.668446406140006,100.948948276113]
[null,null,"2016-01-29",103.26956521743,95.880496428697398,101.00190754898399]
[null,null,"2016-02-01",101.70434782607499,96.272039106814205,101.054894642672]
[null,null,"2016-02-02",98.730434782686601,91.587764884578107,101.10790931922401]
[null,null,"2016-02-03",99.982608695747302,93.941766925272503,101.160951816477]
{"$rows_left_out":672}
{"sheet":"Base Gráfico","index":2,"n_rows":273,"n_cols":19,"rows_kept":273,"cut":false,"hidden":false,"merged":[]}
[null,null,null,null,null,"Planilha Auxiliar Não Modificar"]
[]
[null,"Código:",{"$f":"'Lâmina Debêntures IPCA-Spread'!$F$6","v":"AEGP23"},"← Não Modificar"]
[null,"Data:",{"$f":"'Lâmina Debêntures IPCA-Spread'!$C$2","v":"2024-09-17"},"← Não Modificar",null,"Mínimo:",{"$f":"IFERROR(ROUNDDOWN(MIN(G$11:I$1048576),-1),\"\")","v":90}]
[null,"Final:",{"$f":"IF('Lâmina Debêntures IPCA-Spread'!$P$34=\"DESDE O INÍCIO\",$C$6,'Lâmina Debêntures IPCA-Spread'!$P$34)","v":"1Y"},"← Não Modificar",null,"Máximo:",{"$f":"IFERROR(ROUNDUP(MAX(G$11:I$1048576),-1),\"\")","v":120}]
[null,"Início da Série:",{"$f":"_xll.ECONOMATICA(C3,\"Series Start Date\")","v":"2020-06-24"},"← Não Modificar",null,"VBA Gráfico:",{"$f":"AtualizarLimitesGrafico(\"Lâmina_Debêntures IPCA-Spread\",\"Base100\",G4,G5)","v":{"$error":"#VALUE!"}}]
[null,"Intervalo:",{"$f":"'Lâmina Debêntures IPCA-Spread'!$Q$34","v":"D"},"← Não Modificar"]
[]
[null,"Gráfico PU Mercado x PU Curva",null,null,null,"Gráfico Base 100",null,null,null,null,"Gráfico Taxa (YTM); Mínimo e Máximo",null,null,null,null,"Gráfico Risco e Retorno"]
[null,"Data","PU Mercado","PU Curva",null,"Data",{"$f":"C3","v":"AEGP23"},"CDI Acumulado","IMA-B",null,"Data"," Taxa (YTM)","Mínimo","Máximo",null,"Códigos","Nome",{"$f":"_xll.ECONOMATICA($P$11:$P$18,\"Volatility\",\"12m\",$C$4,,,,,,,\"Volatilidade\")","v":"Volatilidade"},{"$f":"_xll.ECONOMATICA($P$11:$P$18,\"return\",\"12m\",$C$4,,,,,,,\"Retorno\")","v":"Retorno"}]
[null,{"$f":"_xll.ECONOMATICA($C$3,\"Price\",,'Base Gráfico'!C4,$C$5,$C$7,,,,\"false\")","v":"2023-09-15"},6018.577644,{"$f":"_xll.ECONOMATICA($C$3,\"PU Par\",,$C$4,$C$5,$C$7,,,\"false\",\"false\")","v":6166.5754549000003},null,{"$f":"_xll.ECONOMATICA(G10,\"close\",,$C$4,$C$5,$C$7,,,,\"false\",,{\"def.defdef=7\"})","v":"2023-09-15"},100,{"$f":"_xll.ECONOMATICA(H10,\"close\",,$C$4,$C$5,$C$7,,,\"false\",\"false\",,{\"def.defdef=7\"})","v":100},{"$f":"_xll.ECONOMATICA(I10,\"close\",,$C$4,$C$5,$C$7,,,\"false\",\"false\",,{\"def.defdef=7\"})","v":100},null,{"$f":"_xll.ECONOMATICA($C$3,\"YTM\",,$C$4,$C$5,$C$7,,,,\"false\")","v":"2023-09-15"},9.1259999999999994,{"$f":"_xll.ECONOMATICA($C$3,\"Min ind range\",,$C$4,$C$5,$C$7,,,\"false\",\"false\")","v":9.09},{"$f":"_xll.ECONOMATICA($C$3,\"Max ind range\",,$C$4,$C$5,$C$7,,,\"false\",\"false\")","v":9.16},null,{"$f":"G10","v":"AEGP23"},"Título",1.2456551167000001,13.882029664999999]
[null,"2023-09-18",6014.1254726999996,6168.9665326000004,null,"2023-09-18",99.926026187999994,100.04903748,99.926388830999997,null,"2023-09-18",9.2352000000000007,9.17,9.3000000000000007,null,"CDI Acumulado","CDI",4.6943859747000001E-2,11.177662072]
[null,"2023-09-19",6015.3508646,6172.1227833000003,null,"2023-09-19",99.946386345999997,100.09809896,99.823340080999998,null,"2023-09-19",9.2640999999999991,9.2100000000000009,9.32,null,"IDA DI","Ida DI",0.28511780400999998,14.819428339]
[null,"2023-09-20",6017.7764251999997,6174.6115588000002,null,"2023-09-20",99.986687572999998,100.14718456,99.971926139000004,null,"2023-09-20",9.2759999999999998,9.2200000000000006,9.33,null,"IDA Geral","Ida Geral",1.6327187364,12.889980798]
[null,"2023-09-21",6017.3204077,6177.9470305000004,null,"2023-09-21",99.979110741,100.1945334,99.867630922999993,null,"2023-09-21",9.3293999999999997,9.2899999999999991,9.36,null,"IDA IPCA","Ida IPCA",3.9350203701000002,10.149536297999999]
[null,"2023-09-22",6016.6127829999996,6180.3932028999998,null,"2023-09-22",99.967353399000004,100.24190458,99.830409125000003,null,"2023-09-22",9.3867999999999991,9.35,9.42,null,"IMA-B","Ima-B",4.0769425974000004,5.3486964557999999]
[null,"2023-09-25",6020.9542339,6183.5824524,null,"2023-09-25",100.03948756,100.28929821,99.474434407000004,null,"2023-09-25",9.3714999999999993,9.19,9.56,null,"IMA-G","Ima Geral",1.7735800714000001,8.8899348938999996]
[null,"2023-09-26",6012.8753366000001,6186.0857372,null,"2023-09-26",99.905254900000003,100.33671418,98.379079645000004,null,"2023-09-26",9.5366,9.4600000000000009,9.61,null,"IRF-M","Ind RF-M",2.6688932942000001,8.4592354633000006]
[null,"2023-09-27",6010.7263562999997,6187.6944166000003,null,"2023-09-27",99.869549116000002,100.38415261,98.070655317000003,null,"2023-09-27",9.5953999999999997,9.4,9.7899999999999991]
[null,"2023-09-28",6017.7435464,6190.4573051999996,null,"2023-09-28",99.986141283999999,100.43161349,98.598621436000002,null,"2023-09-28",9.5387000000000004,9.3800000000000008,9.6999999999999993]
[null,"2023-09-29",6030.4955239000001,6192.7454547999996,null,"2023-09-29",100.19801821,100.47909683,99.106624092000004,null,"2023-09-29",9.3978000000000002,9.2899999999999991,9.5]
[null,"2023-10-02",6027.5218518000001,6195.4176706999997,null,"2023-10-02",100.14860999,100.52660251,98.580523181999993,null,"2023-10-02",9.4871999999999996,9.36,9.61]
[null,"2023-10-03",6020.0956459999998,6197.9776032,null,"2023-10-03",100.02522193,100.57413065,97.954193556000007,null,"2023-10-03",9.6431000000000004,9.5,9.7799999999999994]
[null,"2023-10-04",6029.7705650999997,6200.9158423999997,null,"2023-10-04",100.18597286000001,100.62168137,98.214752200000007,null,"2023-10-04",9.5465999999999998,9.39,9.7100000000000009]
[null,"2023-10-05",6029.2731003999997,6203.5940945000002,null,"2023-10-05",100.17770736999999,100.66925455000001,98.166626116000003,null,"2023-10-05",9.6006999999999998,9.5,9.7100000000000009]
[null,"2023-10-06",6030.1358133000003,6206.3975023000003,null,"2023-10-06",100.19204154000001,100.71685019,98.483487147000005,null,"2023-10-06",9.6349,9.52,9.75]
[null,"2023-10-09",6046.3651411000001,6209.0420426999999,null,"2023-10-09",100.46169541,100.76446829,98.993231784000002,null,"2023-10-09",9.44,9.3000000000000007,9.58]
[null,"2023-10-10",6050.5011740999998,6211.3758076000004,null,"2023-10-10",100.53041652,100.81210897,99.167653104999999,null,"2023-10-10",9.4250000000000007,9.33,9.52]
[null,"2023-10-11",6038.889048,6210.9318605999997,null,"2023-10-11",100.33747846999999,100.85977212,99.074765939000002,null,"2023-10-11",9.5973000000000006,9.5299999999999994,9.67]
[null,"2023-10-12",null,null,null,"2023-10-12",null,null,null,null,"2023-10-12"]
{"$rows_left_out":244}
{"sheet":"Base","index":3,"n_rows":499,"n_cols":6,"rows_kept":499,"cut":false,"hidden":false,"merged":[]}
[null,null,null,null,null,"Planilha Auxiliar Não Modificar"]
[]
[null,{"$f":"_xll.ECOSECURITIES(\"corporatebond\",\"ACTIVE\",,\"BRA\",,,,\"Tipo de debênture=IPCA Spread\")","v":"Código"},{"$f":"_xll.ECONOMATICA($B$4:$B$501,\"TICKER\")","v":"Código"}]
[null,"QUAT12<BraANB>","QUAT12"]
[null,"QUAT13<BraANB>","QUAT13"]
[null,"AEGP23<BraANB>","AEGP23"]
[null,"TIET18<BraANB>","TIET18"]
[null,"TIET29<BraANB>","TIET29"]
[null,"TIET39<BraANB>","TIET39"]
[null,"AEAB11<BraANB>","AEAB11"]
[null,"AESL17<BraANB>","AESL17"]
[null,"RIGEA3<BraANB>","RIGEA3"]
[null,"AESLA5<BraANB>","AESLA5"]
[null,"AESLA7<BraANB>","AESLA7"]
[null,"AESLB7<BraANB>","AESLB7"]
[null,"TCII11<BraANB>","TCII11"]
[null,"AESOA1<BraANB>","AESOA1"]
[null,"AGVF12<BraANB>","AGVF12"]
[null,"GSTS14<BraANB>","GSTS14"]
[null,"GSTS24<BraANB>","GSTS24"]
[null,"RISP12<BraANB>","RISP12"]
[null,"RISP22<BraANB>","RISP22"]
[null,"RISP14<BraANB>","RISP14"]
[null,"RISP24<BraANB>","RISP24"]
[null,"RIS412<BraANB>","RIS412"]
[null,"RIS422<BraANB>","RIS422"]
[null,"RIS414<BraANB>","RIS414"]
[null,"RIS424<BraANB>","RIS424"]
[null,"ASER12<BraANB>","ASER12"]
[null,"GRRB24<BraANB>","GRRB24"]
{"$rows_left_out":469}