{"text_format":"1","workbook":"xlsx","n_sheets":2,"sheets":["Lâmina Título Público","Base_Gráficos"],"not_rendered":{"charts":4,"images":1,"macros":1,"external_links":0,"defined_names":19,"comments":0,"pivot_tables":0},"unopened":[],"bounds":{"document_bytes":16777216,"sheet_cells":100000,"rows_first":2000,"rows_last":500,"rows_between":2000,"halvings":0,"cell_chars":16384,"cell_head_chars":4096},"cells_cut":0,"cells_raw":0,"read":"whole","date_system":"1900"}

{"sheet":"Lâmina Título Público","index":0,"n_rows":52,"n_cols":15,"rows_kept":52,"cut":false,"hidden":false,"merged":[[1,1,1,2],[2,1,2,2],[4,4,4,5],[22,12,22,13],[5,4,5,5],[11,4,11,5],[9,4,9,5],[6,4,6,5],[8,4,8,5],[10,4,10,5]]}
[null,null,null,null,null,"Lâmina Individual de Título Público"]
[" ","Dta. Últ. Cot.: ",null,{"$f":"IF($D$3=\"\",_xll.ECONOMATICA(\"IBOV\",\"Date of Last Quote\"),$D$3)","v":"2024-09-18"},"← Não Modificar"]
[null,"Dta. Pref. Últ. Cot.: ",null,null,"← Para alterar a data da Célula D2, basta digitar na Célula D3"]
[]
[null,"Características",null,null,"↓ Selecionar o Código ↓",null,null,"Perfil de Risco e Retorno (12M)"]
[null,"Título Público e Vencimento",null,null,"NTN-B 760199 15-08-50",null,null,"Meses Positivos",null,null,{"$f":"IFERROR(_xll.ECONOMATICA($E$7,\"Number Return\",\"12M\",$D$2,,,,,\"false\",\"false\",,{\"std.tec.dret.noprc=true\"}),\"\")","v":6},null,"Volatilidade",null,{"$f":"IFERROR(_xll.ECONOMATICA($E$7,\"Volatility\",\"12M\",$D$2),\"\")","v":7.6810413077000002}]
[null,"Código",null,null,{"$f":"IFERROR(_xll.ECONOMATICA(Base_Gráficos!$C$2,\"Ticker\"),\"\")","v":"BRSTNCNTB3D4"},null,null,"Meses Negativos",null,null,{"$f":"IFERROR(_xll.ECONOMATICA($E$7,\"Number Return\",\"12M\",$D$2,,,,,\"false\",\"false\",,{\"std.tec.dret.cmp=-1\";\"std.tec.dret.noprc=true\"}),\"\")","v":6},null,"Sharpe",null,{"$f":"IFERROR(_xll.ECONOMATICA($E$7,\"Sharpe\",\"12M\",$D$2),\"\")","v":-0.99310237731999995}]
[null,"Pais Sede",null,null,null,{"$f":"IFERROR(_xll.ECONOMATICA($E$7,\"Country of Origin\"),\"\")","v":"BR"},null,"Meses Acima do CDI",null,null,{"$f":"IFERROR(_xll.ECONOMATICA($E$7,\"Number Premium\",\"12M\",$D$2,,,,,\"false\",\"false\",,{\"std.tec.dret.noprc=true\"}),\"\")","v":5},null,"Sharpe - 36M",null,{"$f":"IFERROR(_xll.ECONOMATICA($E$7,\"Sharpe\",\"36M\",$D$2),\"\")","v":-0.60499950391000001}]
[null,"Data de vencimento",null,null,{"$f":"IFERROR(_xll.ECONOMATICA($E$7,\"Maturity date\"),\"\")","v":"2050-08-15"},null,null,"Meses Abaixo do CDI",null,null,{"$f":"IFERROR(_xll.ECONOMATICA($E$7,\"Number Premium\",\"12M\",$D$2,,,,,\"false\",\"false\",,{\"std.tec.dret.cmp=-1\";\"std.tec.dret.noprc=true\"}),\"\")","v":7},null,"VAR de 1M - 95%",null,{"$f":"IFERROR(_xll.ECONOMATICA($E$7,\"VAR %\",\"1M\",$D$2,,,,\"DECIMAL\"),\"\")","v":5.8803600097999996E-3}]
[null,"Data do Início da Série",null,null,{"$f":"IFERROR(_xll.ECONOMATICA($E$7,\"Series Start Date\"),\"\")","v":"2010-02-10"},null,null,"Maior Retorno Mensal",null,null,{"$f":"IFERROR(_xll.ECONOMATICA($E$7,\"Return M\",\"12M\",$D$2,,,,\"decimal\",\"false\",\"false\"),\"\")","v":4.8493818318000002E-2},null,"VAR de 12M - 95%",null,{"$f":"IFERROR(_xll.ECONOMATICA($E$7,\"VAR %\",\"12M\",$D$2,,,,\"DECIMAL\"),\"\")","v":7.9350543073000001E-3}]
[null,"Data da Última Cotação",null,null,{"$f":"IFERROR(_xll.ECONOMATICA($E$7,\"Date of Last Quote\"),\"\")","v":"2024-09-18"},null,null,"Menor Retorno Mensal",null,null,{"$f":"IFERROR(_xll.ECONOMATICA($E$7,\"Return M\",\"12M\",$D$2,,,,\"decimal\",\"false\",\"false\",,{\"std.tec.dret.mom=true\"}),\"\")","v":-3.6105563457000001E-2},null,"Perda Máx (%) - 12M",null,{"$f":"IFERROR(_xll.ECONOMATICA($E$7,\"MaxLoss\",\"12M\",$D$2),\"\")","v":-7.7307687058000001}]
[null,"PU (R$)",null,null,{"$f":"IFERROR(_xll.ECONOMATICA($E$7,\"Price\",,$D$2),\"\")","v":4187.1097090000003},null,null,"Retorno Acumulado (%)",null,null,{"$f":"IFERROR(_xll.ECONOMATICA($E$7,\"return\",L16,$D$2,,,,\"decimal\"),\"\")","v":2.3895250470000001E-2},null,"Máx Drawdown - 12M",null,{"$f":"IFERROR(_xll.ECONOMATICA($E$7,\"MaxDrawdown\",\"12M\",$D$2),\"\")","v":-7.7307687058000001}]
[null,"Taxa (YTM)",null,null,null,{"$f":"IFERROR(_xll.ECONOMATICA($E$7,\"YTM\",,$D$2),\"\")","v":6.3247},null,"Retorno Acumulado (% CDI)",null,null,{"$f":"IFERROR(L18,\"\")","v":4.6732331703405663},null,"Alfa vs. CDI 12M",null,{"$f":"IFERROR(_xll.ECONOMATICA($E$7,\"Alpha\",\"12M\",$D$2),\"\")","v":-9.4308467562999994}]
[]
[null,"Rentabilidade (%)"]
[null,null,{"$f":"IFERROR(EOMONTH(D16,-1),\"\")","v":"2024-04-30"},{"$f":"IFERROR(EOMONTH(E16,-1),\"\")","v":"2024-05-31"},{"$f":"IFERROR(EOMONTH(F16,-1),\"\")","v":"2024-06-30"},{"$f":"IFERROR(EOMONTH(G16,-1),\"\")","v":"2024-07-31"},{"$f":"IFERROR(EOMONTH(H16,-1),\"\")","v":"2024-08-31"},{"$f":"IFERROR(D2,\"\")","v":"2024-09-18"},{"$f":"IFERROR(DATE(YEAR(J16)-1,12,31),\"\")","v":"2022-12-31"},{"$f":"IFERROR(DATE(YEAR(K16)-1,12,31),\"\")","v":"2023-12-31"},{"$f":"IFERROR(D2,\"\")","v":"2024-09-18"},"12m","24m","36m","do início"]
[null,"Título",{"$f":"IFERROR(_xll.ECONOMATICA($E$7,\"return\",\"MTD\",C16,,,,\"decimal\"),\"\")","v":-3.6105563457000001E-2},{"$f":"IFERROR(_xll.ECONOMATICA($E$7,\"return\",\"MTD\",D16,,,,\"decimal\"),\"\")","v":1.6037218858E-2},{"$f":"IFERROR(_xll.ECONOMATICA($E$7,\"return\",\"MTD\",E16,,,,\"decimal\"),\"\")","v":-3.0815053780000001E-2},{"$f":"IFERROR(_xll.ECONOMATICA($E$7,\"return\",\"MTD\",F16,,,,\"decimal\"),\"\")","v":3.6085559927999999E-2},{"$f":"IFERROR(_xll.ECONOMATICA($E$7,\"return\",\"MTD\",G16,,,,\"decimal\"),\"\")","v":9.2569362150000008E-3},{"$f":"IFERROR(_xll.ECONOMATICA($E$7,\"return\",\"MTD\",H16,,,,\"decimal\"),\"\")","v":-4.9425759588999996E-3},{"$f":"IFERROR(_xll.ECONOMATICA($E$7,\"return\",\"YTD\",I16,,,,\"decimal\"),\"\")","v":1.3438985701E-2},{"$f":"IFERROR(_xll.ECONOMATICA($E$7,\"return\",\"YTD\",J16,,,,\"decimal\"),\"\")","v":0.22053188605999999},{"$f":"IFERROR(_xll.ECONOMATICA($E$7,\"return\",\"YTD\",K16,,,,\"decimal\"),\"\")","v":-3.5220693922000001E-2},{"$f":"IFERROR(_xll.ECONOMATICA($E$7,\"return\",L16,$D$2,,,,\"decimal\"),\"\")","v":2.3895250470000001E-2},{"$f":"IFERROR(_xll.ECONOMATICA($E$7,\"return\",M16,$D$2,,,,\"decimal\"),\"\")","v":0.16977342662},{"$f":"IFERROR(_xll.ECONOMATICA($E$7,\"return\",N16,$D$2,,,,\"decimal\"),\"\")","v":0.16118450854999999},{"$f":"IFERROR(_xll.ECONOMATICA($E$7,\"return\",$E$10,,,,,\"decimal\",\"false\",\"false\"),\"\")","v":4.0429450328999996}]
[null,"% CDI",{"$f":"IFERROR(C19/C17,\"\")","v":-0.24578562329788264},{"$f":"IFERROR(D19/D17,\"\")","v":0.51906327214256942},-0.25582588476663692,0.25137832192985893,0.93713790944599262,{"$f":"IFERROR(H19/H17,\"\")","v":-1.0353090617425413},9.2202041996949067,0.5912739042848596,-2.1691861842982574,4.6732331703405663,1.5436020512595812,2.4548282199046358,0.66757073300203773]
[null,"CDI",{"$f":"IFERROR(_xll.ECONOMATICA(\"CDI ACUMULADO\",\"return\",\"MTD\",C16,,,,\"decimal\"),\"\")","v":8.8742284187999995E-3},{"$f":"IFERROR(_xll.ECONOMATICA(\"CDI ACUMULADO\",\"return\",\"MTD\",D16,,,,\"decimal\"),\"\")","v":8.3243312965000007E-3},{"$f":"IFERROR(_xll.ECONOMATICA(\"CDI ACUMULADO\",\"return\",\"MTD\",E16,,,,\"decimal\"),\"\")","v":7.8832883974000005E-3},{"$f":"IFERROR(_xll.ECONOMATICA(\"CDI ACUMULADO\",\"return\",\"MTD\",F16,,,,\"decimal\"),\"\")","v":9.0711275006000007E-3},{"$f":"IFERROR(_xll.ECONOMATICA(\"CDI ACUMULADO\",\"return\",\"MTD\",G16,,,,\"decimal\"),\"\")","v":8.6750258524000007E-3},{"$f":"IFERROR(_xll.ECONOMATICA(\"CDI ACUMULADO\",\"return\",\"MTD\",H16,,,,\"decimal\"),\"\")","v":5.1170936785999996E-3},{"$f":"IFERROR(_xll.ECONOMATICA(\"CDI ACUMULADO\",\"return\",\"YTD\",I16,,,,\"decimal\"),\"\")","v":0.12391019239999999},{"$f":"IFERROR(_xll.ECONOMATICA(\"CDI ACUMULADO\",\"return\",\"YTD\",J16,,,,\"decimal\"),\"\")","v":0.13039474929},{"$f":"IFERROR(_xll.ECONOMATICA(\"CDI ACUMULADO\",\"return\",\"YTD\",K16,,,,\"decimal\"),\"\")","v":7.6400242657000003E-2},{"$f":"IFERROR(_xll.ECONOMATICA(\"CDI ACUMULADO\",\"return\",L16,$D$2,,,,\"decimal\"),\"\")","v":0.11166807711},{"$f":"IFERROR(_xll.ECONOMATICA(\"CDI ACUMULADO\",\"return\",M16,$D$2,,,,\"decimal\"),\"\")","v":0.26206260957999999},{"$f":"IFERROR(_xll.ECONOMATICA(\"CDI ACUMULADO\",\"return\",N16,$D$2,,,,\"decimal\"),\"\")","v":0.39568028020000001},{"$f":"IFERROR(_xll.ECONOMATICA(\"CDI Acumulado\",\"return\",$E$10,,,,,\"decimal\",\"false\",\"false\"),\"\")","v":2.6989517791000002}]
[null,"IMA-B",{"$f":"IFERROR(_xll.ECONOMATICA($B$20,\"return\",\"MTD\",C16,,,,\"decimal\"),\"\")","v":-1.6145047042999999E-2},{"$f":"IFERROR(_xll.ECONOMATICA($B$20,\"return\",\"MTD\",D16,,,,\"decimal\"),\"\")","v":1.329400452E-2},{"$f":"IFERROR(_xll.ECONOMATICA($B$20,\"return\",\"MTD\",E16,,,,\"decimal\"),\"\")","v":-9.6765111374999997E-3},{"$f":"IFERROR(_xll.ECONOMATICA($B$20,\"return\",\"MTD\",F16,,,,\"decimal\"),\"\")","v":2.0935867314999999E-2},{"$f":"IFERROR(_xll.ECONOMATICA($B$20,\"return\",\"MTD\",G16,,,,\"decimal\"),\"\")","v":5.1701581923999998E-3},{"$f":"IFERROR(_xll.ECONOMATICA($B$20,\"return\",\"MTD\",H16,,,,\"decimal\"),\"\")","v":5.5907090426999997E-4},{"$f":"IFERROR(_xll.ECONOMATICA($B$20,\"return\",\"YTD\",I16,,,,\"decimal\"),\"\")","v":6.3692259794999997E-2},{"$f":"IFERROR(_xll.ECONOMATICA($B$20,\"return\",\"YTD\",J16,,,,\"decimal\"),\"\")","v":0.16054306708999999},{"$f":"IFERROR(_xll.ECONOMATICA($B$20,\"return\",\"YTD\",K16,,,,\"decimal\"),\"\")","v":1.5514019901999999E-2},{"$f":"IFERROR(_xll.ECONOMATICA($B$20,\"return\",L16,$D$2,,,,\"decimal\"),\"\")","v":5.5081915113999999E-2},{"$f":"IFERROR(_xll.ECONOMATICA($B$20,\"return\",M16,$D$2,,,,\"decimal\"),\"\")","v":0.19523624161},{"$f":"IFERROR(_xll.ECONOMATICA($B$20,\"return\",N16,$D$2,,,,\"decimal\"),\"\")","v":0.26269937576000002},{"$f":"IFERROR(_xll.ECONOMATICA($B$20,\"return\",$E$10,,,,,\"decimal\",\"false\",\"false\"),\"\")","v":3.8230571216000002}]
[null,"IRF-M",{"$f":"IFERROR(_xll.ECONOMATICA($B$21,\"return\",\"MTD\",C16,,,,\"decimal\"),\"\")","v":-5.2352801222000003E-3},{"$f":"IFERROR(_xll.ECONOMATICA($B$21,\"return\",\"MTD\",D16,,,,\"decimal\"),\"\")","v":6.5692762690999999E-3},{"$f":"IFERROR(_xll.ECONOMATICA($B$21,\"return\",\"MTD\",E16,,,,\"decimal\"),\"\")","v":-2.9484765191000002E-3},{"$f":"IFERROR(_xll.ECONOMATICA($B$21,\"return\",\"MTD\",F16,,,,\"decimal\"),\"\")","v":1.3404597565999999E-2},{"$f":"IFERROR(_xll.ECONOMATICA($B$21,\"return\",\"MTD\",G16,,,,\"decimal\"),\"\")","v":6.5646728671999999E-3},{"$f":"IFERROR(_xll.ECONOMATICA($B$21,\"return\",\"MTD\",H16,,,,\"decimal\"),\"\")","v":7.6612213688000003E-3},{"$f":"IFERROR(_xll.ECONOMATICA($B$21,\"return\",\"YTD\",I16,,,,\"decimal\"),\"\")","v":8.8247019412E-2},{"$f":"IFERROR(_xll.ECONOMATICA($B$21,\"return\",\"YTD\",J16,,,,\"decimal\"),\"\")","v":0.16509056248000001},{"$f":"IFERROR(_xll.ECONOMATICA($B$21,\"return\",\"YTD\",K16,,,,\"decimal\"),\"\")","v":4.3379817821999997E-2},{"$f":"IFERROR(_xll.ECONOMATICA($B$21,\"return\",L16,$D$2,,,,\"decimal\"),\"\")","v":8.5641862604999994E-2},{"$f":"IFERROR(_xll.ECONOMATICA($B$21,\"return\",M16,$D$2,,,,\"decimal\"),\"\")","v":0.24817718291999999},{"$f":"IFERROR(_xll.ECONOMATICA($B$21,\"return\",N16,$D$2,,,,\"decimal\"),\"\")","v":0.33841382301},{"$f":"IFERROR(_xll.ECONOMATICA($B$21,\"return\",$E$10,,,,,\"decimal\",\"false\",\"false\"),\"\")","v":3.2898736983000001}]
[]
[null,{"$f":"\"Desempenho em \"&M23","v":"Desempenho em 12M"},null,null,null,null,null,null,null,null,"Selecione os Meses ou Digite uma Data e Selecionar um Período (M = Mês; Q = Trimestre; Y = Anos) →","Período:","12M",null,"D"]
[]
[]
[]
[]
[]
[]
[]
[]
[]
[]
[]
[]
[]
[]
[null,"Perfil de Risco x Retorno (Últimos 12 meses)",null,null,null,null,null,null,"Taxa YTM x PU do Título"]
[]
[]
{"$rows_left_out":13}
{"sheet":"Base_Gráficos","index":1,"n_rows":272,"n_cols":24,"rows_kept":272,"cut":false,"hidden":false,"merged":[[3,7,3,8]]}
[null,null,null,"Planilha Auxiliar Não Modificar"]
[null,"Ativo:",{"$f":"INDEX(C:C,MATCH('Lâmina Título Público'!E6,Base_Gráficos!F:F,0))","v":"BRSTNCNTB3D4"},null,null,null,null,"Mínimo:",{"$f":"ROUNDDOWN(MIN(I$10:L$526),-1)","v":90}]
[null,"Inicio:",{"$f":"'Lâmina Título Público'!D2","v":"2024-09-18"},null,null,null,null,"Máximo:",{"$f":"ROUNDUP(MAX($I$10:$L$526),-1)","v":120}]
[null,"Final:",{"$f":"IF('Lâmina Título Público'!M23=\"DESDE O INÍCIO\",C6,'Lâmina Título Público'!M23)","v":"12M"},null,null,null,null,"VBA Gráfico:",{"$f":"AtualizarLimitesGrafico(\"Lâmina_Título Público\",\"Base100\",I2,I3)","v":{"$error":"#VALUE!"}}]
[null,"Intervalo:",{"$f":"'Lâmina Título Público'!O23","v":"D"}]
[null,"Data do Início da Série:",{"$f":"IFERROR(_xll.ECONOMATICA($C$2,\"Series Start Date\"),\"\")","v":"2010-02-10"}]
[]
[null,"Seleção de Títulos",null,null,null,null,null,"Gráfico  Base 100",null,null,null,null,null,"Gráfico  Taxa YTM e PU do Título",null,null,null,"Gráfico Retorno",null,null,null,"Gráfico  Risco e Retorno"]
[null,{"$f":"_xll.ECOSECURITIES(\"governmentbond\",\"Active\",,\"BRA\")","v":"Código"},{"$f":"_xll.ECONOMATICA($B$10:$B$101,\"ticker\")","v":"Código"},{"$f":"_xll.ECONOMATICA($B$10:$B$101,\"name\")","v":"Nome"},{"$f":"_xll.ECONOMATICA($B$10:$B$101,\"Maturity date\")","v":"Data de vencimento"},"Título e Vencimento",null,"Data",{"$f":"_xll.ECONOMATICA($C$2,\"ticker\")","v":"BRSTNCNTB3D4"},"CDI Acumulado","IMA-B","IRF-M",null,"Data","YTM","PU",null,"Data",{"$f":"_xll.ECONOMATICA($C$2,\"ticker\")","v":"BRSTNCNTB3D4"},"CDI Acumulado",null,"Ativos",{"$f":"_xll.ECONOMATICA(V10:V13,\"return\",C4,C3,,,,,\"false\",,\"Retorno\")","v":"Retorno"},{"$f":"_xll.ECONOMATICA(V10:V13,\"volatility\",C4,C3,,,,,\"false\",,\"Volatilidade\")","v":"Volatilidade"}]
[null,"BRSTNCLF0008<BraANB>","BRSTNCLF0008","LFT 210100","2024-09-01",{"$f":"IF(D10=\"\",\"\",CONCATENATE(D10,\" \",TEXT(E10,\"dd-mm-aa\")))","v":"LFT 210100 01-09-24"},null,{"$f":"_xll.ECONOMATICA($C$2,\"close\",,$C$3,$C$4,$C$5,,,,\"false\",,{\"def.defdef=7\"})","v":"2023-09-18"},100,{"$f":"_xll.ECONOMATICA($J$9,\"close\",,$C$3,$C$4,$C$5,,,\"false\",\"false\",,{\"def.defdef=7\"})","v":100},{"$f":"_xll.ECONOMATICA($K$9,\"close\",,$C$3,$C$4,$C$5,,,\"FALSE\",\"false\",,{\"def.defdef=7\"})","v":100},{"$f":"_xll.ECONOMATICA($L$9,\"close\",,$C$3,$C$4,$C$5,,,\"FALSE\",\"false\",,{\"def.defdef=7\"})","v":100},null,{"$f":"_xll.ECONOMATICA($C$2,\"YTM\",,$C$3,$C$4,$C$5,,,,\"false\")","v":"2023-09-18"},5.7171000000000003,{"$f":"_xll.ECONOMATICA(C2,\"Price\",,$C$3,$C$4,$C$5,,,\"false\",\"false\")","v":4089.3926474},null,{"$f":"_xll.ECONOMATICA($C$2,\"return\",,$C$3,$C$4,\"M\",,\"decimal\",,\"false\")","v":"2023-09-30"},null,{"$f":"_xll.ECONOMATICA($T$9,\"return\",,$C$3,C4,\"M\",,\"decimal\",\"false\",\"false\")","v":""},null,{"$f":"C2","v":"BRSTNCNTB3D4"},2.3895250469999998,7.6810413077000002]
[null,"BRSTNCLF1RC4<BraANB>","BRSTNCLF1RC4","LFT 210100","2025-03-01",{"$f":"IF(D11=\"\",\"\",CONCATENATE(D11,\" \",TEXT(E11,\"dd-mm-aa\")))","v":"LFT 210100 01-03-25"},null,"2023-09-19",99.824013453000006,100.04903743,99.896875339000005,99.898733977000006,null,"2023-09-19",5.7336,4082.1958665000002,null,"2023-10-31",-1.2438560497E-2,9.9757182943000008E-3,null,{"$f":"J9","v":"CDI Acumulado"},11.166807711000001,4.6501741987000002E-2]
[null,"BRSTNCLF1RD2<BraANB>","BRSTNCLF1RD2","LFT 210100","2025-09-01","LFT 210100 01-09-25",null,"2023-09-20",100.17570974,100.09809896,100.04557085,99.999756317999996,null,"2023-09-20",5.71,4096.5781088000003,null,"2023-11-30",3.9817514706E-2,9.1599122496999995E-3,null,{"$f":"K9","v":"IMA-B"},5.5081915113999997,4.0762384749000002]
[null,"BRSTNCLF1RE0<BraANB>","BRSTNCLF1RE0","LFT 210100","2026-03-01","LFT 210100 01-03-26",null,"2023-09-21",99.950782458999996,100.1454246,99.941198807999996,99.876387469999997,null,"2023-09-21",5.7302,4087.3799488999998,null,"2023-12-31",4.8493818318000002E-2,8.9452887386999996E-3,null,{"$f":"L9","v":"IRF-M"},8.5641862604999996,2.6703335965999999]
[null,"BRSTNCLF1RF7<BraANB>","BRSTNCLF1RF7","LFT 210100","2026-09-01","LFT 210100 01-09-26",null,"2023-09-22",99.809419493999997,100.19277255999999,99.903949589999996,99.926456614000003,null,"2023-09-22",5.7441000000000004,4081.5990621999999,null,"2024-01-31",-1.9568164494E-2,9.6669542107999992E-3]
[null,"BRSTNCLF1RG5<BraANB>","BRSTNCLF1RG5","LFT 210100","2027-03-01","LFT 210100 01-03-27",null,"2023-09-25",99.140041490000002,100.24014296999999,99.547712641999993,99.801576741000005,null,"2023-09-25",5.7986000000000004,4054.2255673999998,null,"2024-02-29",4.3924058863999997E-3,8.0020821496999996E-3]
[null,"BRSTNCLF1RH3<BraANB>","BRSTNCLF1RH3","LFT 210100","2027-09-01","LFT 210100 01-09-27",null,"2023-09-26",97.082901453999995,100.28753569,98.451550982000001,99.585227161999995,null,"2023-09-26",5.9630999999999998,3970.1010338999999,null,"2024-03-31",-7.9903523274000004E-3,8.3167671581999992E-3]
[null,"BRSTNCLF1RI1<BraANB>","BRSTNCLF1RI1","LFT 210100","2028-03-01","LFT 210100 01-03-28",null,"2023-09-27",96.693966162999999,100.33495087,98.142899452999998,99.284375049999994,null,"2023-09-27",5.9955999999999996,3954.1959428,null,"2024-04-30",-3.6105563457000001E-2,8.8742284187999995E-3]
[null,"BRSTNCLF1RK7<BraANB>","BRSTNCLF1RK7","LFT 210100","2028-09-01","LFT 210100 01-09-28",null,"2023-09-28",97.681281497000001,100.38238849,98.671254500000003,99.383211103999997,null,"2023-09-28",5.92,3994.5711434,null,"2024-05-31",1.6037218858E-2,8.3243312965000007E-3]
[null,"BRSTNCLF1RL5<BraANB>","BRSTNCLF1RL5","LFT 210100","2029-03-01","LFT 210100 01-03-29",null,"2023-09-29",98.569016235999996,100.42984856,99.179631377999996,99.687974815000004,null,"2023-09-29",5.8532999999999999,4030.8741025999998,null,"2024-06-30",-3.0815053780000001E-2,7.8832883974000005E-3]
[null,"BRSTNCLF1RM3<BraANB>","BRSTNCLF1RM3","LFT 210100","2029-09-01","LFT 210100 01-09-29",null,"2023-10-02",97.491888939999996,100.47733095,98.653142912999996,99.404046261999994,null,"2023-10-02",5.9409999999999998,3986.8261381000002,null,"2024-07-31",3.6085559927999999E-2,9.0711275006000007E-3]
[null,"BRSTNCLF1RO9<BraANB>","BRSTNCLF1RO9","LFT 210100","2030-03-01","LFT 210100 01-03-30",null,"2023-10-03",96.579009439999993,100.52483579,98.026351899999995,99.113990869000006,null,"2023-10-03",6.0170000000000003,3949.4949109999998,null,"2024-08-31",9.2569362150000008E-3,8.6750258524000007E-3]
[null,"BRSTNCLF1RQ4<BraANB>","BRSTNCLF1RQ4","LFT 210100","2030-06-01","LFT 210100 01-06-30",null,"2023-10-04",96.828242278999994,100.57236321000001,98.287102485999995,99.430010397999993,null,"2023-10-04",6,3959.6870204000002,null,"2024-09-30",-4.9425759588999996E-3,5.1170936785999996E-3]
[null,"BRSTNCLF1RR2<BraANB>","BRSTNCLF1RR2","LFT 210100","2030-09-01","LFT 210100 01-09-30",null,"2023-10-05",96.711840303000002,100.61991307,98.238940948999996,99.428467497,null,"2023-10-05",6.0124000000000004,3954.9268866000002]
[null,"BRSTNCLTN822<BraANB>","BRSTNCLTN822","LTN 100000","2024-10-01","LTN 100000 01-10-24",null,"2023-10-06",97.207604007,100.66748538,98.556035397000002,99.535044119999995,null,"2023-10-06",5.9756999999999998,3975.2006110000002]
[null,"BRSTNCLTN7N2<BraANB>","BRSTNCLTN7N2","LTN 100000","2025-01-01","LTN 100000 01-01-25",null,"2023-10-09",97.96092677,100.71508014,99.066155539999997,99.844719530000006,null,"2023-10-09",5.9188999999999998,4006.0069367000001]
[null,"BRSTNCLTN830<BraANB>","BRSTNCLTN830","LTN 100000","2025-04-01","LTN 100000 01-04-25",null,"2023-10-10",98.372475218999995,100.76269748,99.240705348000006,100.06059528,null,"2023-10-10",5.8895,4022.8367687]
[null,"BRSTNCLTN7Z6<BraANB>","BRSTNCLTN7Z6","LTN 100000","2025-07-01","LTN 100000 01-07-25",null,"2023-10-11",98.478660903000005,100.81033726,99.147749755999996,99.968061262000006,null,"2023-10-11",5.88,4027.1791182000002]
[null,"BRSTNCLTN863<BraANB>","BRSTNCLTN863","LTN 100000","2025-10-01","LTN 100000 01-10-25",null,"2023-10-12",null,null,null,null,null,"2023-10-12"]
[null,"BRSTNCLTN7U7<BraANB>","BRSTNCLTN7U7","LTN 100000","2026-01-01","LTN 100000 01-01-26",null,"2023-10-13",97.881405787000006,100.85799962,98.833226527999997,99.785494100999998,null,"2023-10-13",5.9298000000000002,4002.7550114999999]
[null,"BRSTNCLTN8B5<BraANB>","BRSTNCLTN8B5","LTN 100000","2026-04-01","LTN 100000 01-04-26",null,"2023-10-16",98.317100296000007,100.90568455,99.121077408000005,100.00181431999999,null,"2023-10-16",5.8982000000000001,4020.5722707]
[null,"BRSTNCLTN848<BraANB>","BRSTNCLTN848","LTN 100000","2026-07-01","LTN 100000 01-07-26",null,"2023-10-17",97.809401710000003,100.95339193,98.749065392000006,99.766914724000003,null,"2023-10-17",5.9412000000000003,3999.8104819999999]
[null,"BRSTNCLTN8G4<BraANB>","BRSTNCLTN8G4","LTN 100000","2026-10-01","LTN 100000 01-10-26",null,"2023-10-18",97.863904875000003,101.00112188999999,98.784145831000004,99.769667890999997,null,"2023-10-18",5.9398,4002.0393303999999]
[null,"BRSTNCLTN871<BraANB>","BRSTNCLTN871","LTN 100000","2027-07-01","LTN 100000 01-07-27",null,"2023-10-19",96.322518133000003,101.04887443,98.074482563000004,99.526306327,null,"2023-10-19",6.0664999999999996,3939.0059743000002]
[null,"BRSTNCLTN897<BraANB>","BRSTNCLTN897","LTN 100000","2028-01-01","LTN 100000 01-01-28",null,"2023-10-20",96.844556861000001,101.09664954,98.345182629000007,99.820850788000001,null,"2023-10-20",6.0271999999999997,3960.3541876999998]
[null,"BRSTNCLTN8F6<BraANB>","BRSTNCLTN8F6","LTN 100000","2028-07-01","LTN 100000 01-07-28",null,"2023-10-23",96.809421924999995,101.14444722,98.303317978999999,99.855435075000003,null,"2023-10-23",6.0330000000000004,3958.9173821999998]
[null,"BRSTNCLTN8A7<BraANB>","BRSTNCLTN8A7","LTN 100000","2030-01-01","LTN 100000 01-01-30",null,"2023-10-24",97.286294999000006,101.19226748,98.563209819999997,100.11545128,null,"2023-10-24",5.9976000000000003,3978.4185945999998]
[null,"BRSTNCNTB096<BraANB>","BRSTNCNTB096","NTN-B 760199","2024-08-15","NTN-B 760199 15-08-24",null,"2023-10-25",97.111382301999996,101.24011044,98.472461284000005,100.18031341,null,"2023-10-25",6.0145999999999997,3971.2657276999998]
[null,"BRSTNCNTB633<BraANB>","BRSTNCNTB633","NTN-B 760199","2025-05-15","NTN-B 760199 15-05-25",null,"2023-10-26",98.752436177000007,101.28797598,99.332676004999996,100.58733934999999,null,"2023-10-26",5.8872,4038.3748642]
[null,"BRSTNCNTB4U6<BraANB>","BRSTNCNTB4U6","NTN-B 760199","2026-08-15","NTN-B 760199 15-08-26",null,"2023-10-27",98.201286877000001,101.33586409999999,98.999441582000003,100.31389292999999,null,"2023-10-27",5.9321999999999999,4015.8362052000002]
[null,"BRSTNCNTB682<BraANB>","BRSTNCNTB682","NTN-B 760199","2027-05-15","NTN-B 760199 15-05-27",null,"2023-10-30",97.585038376,101.38377491999999,98.609917125999999,100.01212241,null,"2023-10-30",5.984,3990.6353843000002]
{"$rows_left_out":232}