{"text_format":"1","workbook":"xlsx","n_sheets":3,"sheets":["Referências","Fundamental Analysis","Base Data"],"not_rendered":{"charts":0,"images":1,"macros":1,"external_links":0,"defined_names":38,"comments":1,"pivot_tables":0},"unopened":[],"bounds":{"document_bytes":16777216,"sheet_cells":100000,"rows_first":2000,"rows_last":500,"rows_between":2000,"halvings":0,"cell_chars":16384,"cell_head_chars":4096},"cells_cut":0,"cells_raw":0,"read":"whole","date_system":"1900"}

{"sheet":"Referências","index":0,"n_rows":5221,"n_cols":8,"rows_kept":5221,"cut":false,"hidden":true,"merged":[]}
[null,null,null,null,null,null,"Datas","Bovespa"]
["Nome","Código",null,null,null,null,{"$f":"_xll.ECONOMATICA(\"ibov\",\"close\",,\"latest\",\"20y\",\"d\",,,\"true\",\"false\")","v":"2000-05-08"},14890]
["IDIV - Índice Dividendos BM&FBOVESPA ","IDIV",null,null,null,null,"2000-05-09",14581]
["IBOVESPA - Índice Bovespa","IBOV",null,null,null,null,"2000-05-10",14433]
["IBRA - Índice Brasil Amplo BM&FBOVESPA ","IBRA",null,null,null,null,"2000-05-11",14498]
["IBRX 50 - Índice Brasil 50","IBXL",null,null,null,null,"2000-05-12",14458]
["IBRX 100 - Índice Brasil 100","IBXX",null,null,null,null,"2000-05-15",15055]
["IVBX 2 - Índice Valor BM&FBOVESPA","IVBX",null,null,null,null,"2000-05-16",15360]
["MLCX - Índice MidLarge Cap","MLCX",null,null,null,null,"2000-05-17",14870]
["SMLL - Índice Small Cap","SMLL",null,null,null,null,"2000-05-18",14626]
[null,null,null,null,null,null,"2000-05-19",14326]
[null,null,null,null,null,null,"2000-05-22",13891]
[null,null,null,null,null,null,"2000-05-23",13587]
[null,null,null,null,null,null,"2000-05-24",14166]
[null,null,null,null,null,null,"2000-05-25",14185]
[null,null,null,null,null,null,"2000-05-26",14542]
[null,null,null,null,null,null,"2000-05-29",14772]
[null,null,null,null,null,null,"2000-05-30",15248]
[null,null,null,null,null,null,"2000-05-31",14956]
[null,null,null,null,null,null,"2000-06-01",15450]
[null,null,null,null,null,null,"2000-06-02",16222]
[null,null,null,null,null,null,"2000-06-05",16022]
[null,null,null,null,null,null,"2000-06-06",15946]
[null,null,null,null,null,null,"2000-06-07",16271]
[null,null,null,null,null,null,"2000-06-08",16398]
[null,null,null,null,null,null,"2000-06-09",16342]
[null,null,null,null,null,null,"2000-06-12",16096]
[null,null,null,null,null,null,"2000-06-13",16354]
[null,null,null,null,null,null,"2000-06-14",16366]
[null,null,null,null,null,null,"2000-06-15",16561]
[null,null,null,null,null,null,"2000-06-16",16424]
[null,null,null,null,null,null,"2000-06-19",16850]
[null,null,null,null,null,null,"2000-06-20",16843]
[null,null,null,null,null,null,"2000-06-21",17254]
[null,null,null,null,null,null,"2000-06-22"]
[null,null,null,null,null,null,"2000-06-23",16977]
[null,null,null,null,null,null,"2000-06-26",16744]
[null,null,null,null,null,null,"2000-06-27",16512]
[null,null,null,null,null,null,"2000-06-28",16842]
[null,null,null,null,null,null,"2000-06-29",16407]
[null,null,null,null,null,null,"2000-06-30",16727]
[null,null,null,null,null,null,"2000-07-03",17088]
[null,null,null,null,null,null,"2000-07-04",17279]
[null,null,null,null,null,null,"2000-07-05",17134]
[null,null,null,null,null,null,"2000-07-06",17348]
[null,null,null,null,null,null,"2000-07-07",17598]
[null,null,null,null,null,null,"2000-07-10",17471]
[null,null,null,null,null,null,"2000-07-11",16880]
[null,null,null,null,null,null,"2000-07-12",17053]
[null,null,null,null,null,null,"2000-07-13",16444]
[null,null,null,null,null,null,"2000-07-14",16880]
[null,null,null,null,null,null,"2000-07-17",17387]
[null,null,null,null,null,null,"2000-07-18",17368]
[null,null,null,null,null,null,"2000-07-19",16927]
[null,null,null,null,null,null,"2000-07-20",17203]
[null,null,null,null,null,null,"2000-07-21",17318]
[null,null,null,null,null,null,"2000-07-24",17385]
[null,null,null,null,null,null,"2000-07-25",17049]
[null,null,null,null,null,null,"2000-07-26",17121]
[null,null,null,null,null,null,"2000-07-27",16948]
{"$rows_left_out":5162}
{"sheet":"Fundamental Analysis","index":1,"n_rows":204,"n_cols":38,"rows_kept":204,"cut":false,"hidden":false,"merged":[[8,2,8,11],[7,13,7,15],[8,15,8,20],[8,24,8,35],[8,37,9,37]]}
[]
["COMPANY:","Avianca Holdings S.A. Pref"]
["SYMBOL:",{"$f":"VLOOKUP(B2,'Base Data'!D1:E528,2,FALSE)","v":"PFAVH<XBOG>"}]
["START DATE:",{"$f":"EDATE(B5,-B6*12)","v":"2014-12-31"}]
["DATE OF LAST FS:",{"$f":"_xll.ECONOMATICA($B$3,\"Fin Statm Date\")","v":"2019-12-31"}]
["PERIOD IN YEARS:",5]
["FREQUENCY:","Y"]
["COUNTRY:","Colombia"]
[null,null,"Multiples",null,null,null,null,null,null,null,null,null,null,null,null,"Results",null,null,null,null,null,"Períod:","12m",null,"Financial Indicators & Other Balance Sheet Items"]
[null,null,null,null,null,null,null,null,null,null,null,null,null,null,null,null,null,null,null,null,null,null,null,null,null,null,null,null,null,null,null,null,null,null,null,null,0]
[null,{"$f":"_xll.ECONOMATICA($B$3,\"CLOSE\",,$B$5,$B$4,$B$7,,,\"TRUE\",\"TRUE\",\"Close\",)","v":"fecha"},"Close",{"$f":"_xll.ECONOMATICA($B$3,\"MarketCapitaliz\",,$B$5,$B$4,$B$7,,\"THOUSANDS\",\"FALSE\",\"TRUE\",\"Market Value\",)","v":"Market Value"},{"$f":"_xll.ECONOMATICA($B$3,\"EV\",,$B$5,$B$4,$B$7,,\"THOUSANDS\",\"FALSE\",\"TRUE\",\"EV\",)","v":"EV"},{"$f":"_xll.ECONOMATICA($B$3,\"P/BV\",,$B$5,$B$4,$B$7,,,\"FALSE\",\"TRUE\",\"P/BV\",)","v":"P/BV"},{"$f":"_xll.ECONOMATICA($B$3,\"P/E\",,$B$5,$B$4,$B$7,,,\"FALSE\",\"TRUE\",\"P/E\",)","v":"P/E"},{"$f":"_xll.ECONOMATICA($B$3,\"EV/EBITDA co\",,$B$5,$B$4,$B$7,,,\"FALSE\",\"TRUE\",\"EV/EBITDA\",)","v":"EV/EBITDA"},{"$f":"_xll.ECONOMATICA($B$3,\"P/EBITDA\",,$B$5,$B$4,$B$7,,,\"FALSE\",\"TRUE\",\"P/EBITDA\",)","v":"P/EBITDA"},{"$f":"_xll.ECONOMATICA($B$3,\"P/FCF\",,$B$5,$B$4,$B$7,,,\"FALSE\",\"TRUE\",\"P/FCF\",)","v":"P/FCF"},{"$f":"_xll.ECONOMATICA($B$3,\"PSR\",,$B$5,$B$4,$B$7,,,\"FALSE\",\"TRUE\",\"P/Sales\",)","v":"P/Sales"},{"$f":"_xll.ECONOMATICA($B$3,\"Cap Str(Mkt Cap)\",,$B$5,$B$4,$B$7,,,\"FALSE\",\"TRUE\",\"D/(D+E)\",)","v":"D/(D+E)"},null,{"$f":"_xll.ECONOMATICA($B$3,\"Revenues\",$W$9,$B$5,$B$4,$B$7,,\"THOUSANDS\",\"FALSE\",\"TRUE\",\"Revenues\",)","v":"Revenues"},{"$f":"_xll.ECONOMATICA($B$3,\"Gross Profit\",$W$9,$B$5,$B$4,$B$7,,\"THOUSANDS\",\"FALSE\",\"TRUE\",\"Gross Profit\",)","v":"Gross Profit"},{"$f":"_xll.ECONOMATICA($B$3,\"GrossMargin\",$W$9,$B$5,$B$4,$B$7,,,\"FALSE\",\"TRUE\",\"Gross Margin\",)","v":"Gross Margin"},{"$f":"_xll.ECONOMATICA($B$3,\"EBIT\",$W$9,$B$5,$B$4,$B$7,,\"THOUSANDS\",\"FALSE\",\"TRUE\",\"EBIT\",)","v":"EBIT"},{"$f":"_xll.ECONOMATICA($B$3,\"EBITMargin\",$W$9,$B$5,$B$4,$B$7,,,\"FALSE\",\"TRUE\",\"EBIT Margin\",)","v":"EBIT Margin"},{"$f":"_xll.ECONOMATICA($B$3,\"Net Income\",$W$9,$B$5,$B$4,$B$7,,\"THOUSANDS\",\"FALSE\",\"TRUE\",\"Earnings\",)","v":"Earnings"},{"$f":"_xll.ECONOMATICA($B$3,\"Net Margin\",$W$9,$B$5,$B$4,$B$7,,,\"FALSE\",\"TRUE\",\"Net Margin\",)","v":"Net Margin"},{"$f":"_xll.ECONOMATICA($B$3,\"ROE (avg)\",$W$9,$B$5,$B$4,$B$7,,,\"FALSE\",\"TRUE\",\"ROE\",)","v":"ROE"},{"$f":"_xll.ECONOMATICA($B$3,\"ROA\",$W$9,$B$5,$B$4,$B$7,,,\"FALSE\",\"TRUE\",\"ROA\",)","v":"ROA"},{"$f":"_xll.ECONOMATICA($B$3,\"ROIC (avg IC) %\",$W$9,$B$5,$B$4,$B$7,,,\"FALSE\",\"TRUE\",\"ROIC\",)","v":"ROIC"},null,{"$f":"_xll.ECONOMATICA($B$3,\"Total Assets\",,$B$5,$B$4,$B$7,,\"THOUSANDS\",\"FALSE\",\"TRUE\",\"Total Assets\")","v":"Total Assets"},{"$f":"_xll.ECONOMATICA($B$3,\"Stock Eq Par\",,$B$5,$B$4,$B$7,,\"THOUSANDS\",\"FALSE\",\"TRUE\",\"Shareholder's Equity\",)","v":"Shareholder's Equity"},{"$f":"_xll.ECONOMATICA($B$3,\"TtDebtGr\",,$B$5,$B$4,$B$7,,\"THOUSANDS\",\"FALSE\",\"TRUE\",\"Gross Debt\",)","v":"Gross Debt"},{"$f":"_xll.ECONOMATICA($B$3,\"TtNetDebt\",,$B$5,$B$4,$B$7,,\"THOUSANDS\",\"FALSE\",\"TRUE\",\"Net Debt\",)","v":"Net Debt"},"Cash","% Cash",{"$f":"_xll.ECONOMATICA($B$3,\"WorkCap\",,$B$5,$B$4,$B$7,,\"THOUSANDS\",\"FALSE\",\"TRUE\",\"Working Capital\",)","v":"Working Capital"},{"$f":"_xll.ECONOMATICA($B$3,\"DebtGr/Assets\",,$B$5,$B$4,$B$7,,,\"FALSE\",\"TRUE\",\"Gross Debt/Assets\",)","v":"Gross Debt/Assets"},{"$f":"_xll.ECONOMATICA($B$3,\"DebtGr/StkEq\",,$B$5,$B$4,$B$7,,,\"FALSE\",\"TRUE\",\"Gross Debt/Equity\",)","v":"Gross Debt/Equity"},{"$f":"_xll.ECONOMATICA($B$3,\"EBIT/DebtGr\",,$B$5,$B$4,$B$7,,,\"FALSE\",\"TRUE\",\"EBIT/Gross Debt\",)","v":"EBIT/Gross Debt"},{"$f":"_xll.ECONOMATICA($B$3,\"NetDebt/Ebitda\",,$B$5,$B$4,$B$7,,,\"FALSE\",\"TRUE\",\"Net Debt/EBITDA\",)","v":"Net Debt/EBITDA"},{"$f":"_xll.ECONOMATICA($B$3,\"DebtST/DebtTt\",,$B$5,$B$4,$B$7,,,\"FALSE\",\"TRUE\",\"% ST Debt\",)","v":"% ST Debt"},null,{"$f":"_xll.ECONOMATICA($B$3,\"Num of Shares\",,$B$5,$B$4,$B$7,,,\"false\",\"true\",\" Shares Oustanding\",)","v":" Shares Oustanding"}]
[null,null,"PFAVH","PFAVH","PFAVH","PFAVH","PFAVH","PFAVH","PFAVH","PFAVH","PFAVH","PFAVH",null,"PFAVH","PFAVH","PFAVH","PFAVH","PFAVH","PFAVH","PFAVH","PFAVH","PFAVH","PFAVH",null,"PFAVH","PFAVH","PFAVH","PFAVH",{"$f":"AB12","v":"PFAVH"},{"$f":"AC12","v":"PFAVH"},"PFAVH","PFAVH","PFAVH","PFAVH","PFAVH","PFAVH",null,"PFAVH"]
[null,"2014-12-31",2997.1372526548798,3409696524.96,9479472812.4319992,1.1802719986080801,11.8293174721912,8.1782270642288495,2.9416480170330002,null,0.303099732767805,68.998688447987703,null,11249421086.016001,11249421086.016001,100,680858229.10000002,6.0523845973439201,288241188.30000001,2.5622757482014999,10.971011772388,1.9478187819258901,5.7917625807676796,null,14798152219.007999,2888907412,7588859195.0080004,6051667757.7279997,{"$f":"IF(AA13-AB13<>0,AA13-AB13,\"\")","v":1537191437.2800007},{"$f":"IFERROR(AC13/Y13,\"\")","v":0.10387725538500016},-1349002926,51.282478262786803,261.05323627730797,8.9718126480438496,5.2209562724892704,14.472271349091899,null,996987288]
[null,"2015-12-31",1485.48245037533,1689893453.1619999,12984738609.455999,0.39556197920183001,-3.4467691755962702,9.1543496326776204,1.1913890589148699,1.91201705242383,0.12280318568491599,88.295887633692502,null,13760990350,6009438322.4399996,43.670100549410598,690412619.51999998,5.0171724705796796,-490283325.36000001,-3.1986950802565799,-12.162842103381999,-2.1174735968452301,null,null,20787608496.063999,4272133172.5799999,12748565442.976,11236012924.16,{"$f":"IF(AA14-AB14<>0,AA14-AB14,\"\")","v":1512552518.816},{"$f":"IFERROR(AC14/Y14,\"\")","v":7.2762218852755092E-2},-1673172148.1440001,61.327715717721702,294.358514827676,5.41561027088028,7.9214833566293201,21.5683925723133,null,996987288]
[null,"2016-12-31",3222.7139463499202,3589154236.8000002,14337469402.848,0.85404782704244997,70.441794358426705,9.0490168256364996,2.26527542385884,2.3999889004044199,0.28902947710048499,76.702464838977903,null,12417952219.983999,5769171047.4320002,46.458312491711702,775593513.70000005,6.24574406440661,50952055.799999997,1.0677233227452201,3.08607296354967,0.69569625913391098,3.16740443823437,null,19058514447.84,4202521361.3959999,11816570926.752001,10689045142.128,1127525784.6240005,5.9161262946797452E-2,-2024627048.372,62.0015319614322,277.26769938739,6.5636090072730404,6.7463334444473704,24.315597681532399,null,996987288]
[null,"2017-12-31",2715.5533533357102,2941112499.5999999,14374518357.216,0.69913494403772303,20.518074994906801,7.9683627460617599,1.63037471526877,2.2326273080179799,0.222827734599605,81.746641600737306,null,13199041424.912001,5963383878.3520002,45.180431565968298,872601319.71899998,6.6110961518133999,143342516.30974999,1.8468670891488701,5.9146470898122097,1.1955584548668401,3.6208932068475401,null,20389530195.487999,4206788009.5,13171607336.768,11659101156.112,1512506180.6560001,7.4180531191969434E-2,-1901911547.4920001,64.599856938701095,330.85407180711599,6.62486587558669,6.4630998407228599,25.548657943669198,null,996987288]
[null,"2018-12-31",1597.1239102054401,1654998898.0799999,16219117495.104,0.440702088863418,-20.532580928265801,8.0303290160081797,0.81941484650542395,1.74131293450591,0.10412743946585599,90.641836959868698,null,15893974792.511999,6878082876,43.274781581014402,754318971,4.7459429176596997,-80603549.25,2.3370266396483399E-2,0.103784557097924,1.6090034370449799E-2,2.8282833058983701,null,23085496056.032001,3755368853.2519999,16030084071.76,15142551348.768,887532722.99200058,3.8445469000875011E-2,-3456369105.0040002,69.437901758123203,504.576848875731,4.7056457572107302,7.4973049248292201,25.328232151368901,null,996987288]
[null,"2019-12-31",1835,1829471673.4820001,19797234402.816002,2.5159839717198298,-0.57090911010072898,144.31510941428101,13.336226634171901,1.28318431783555,0.112873949216464,91.572105600731405,null,16208094836.576,7501185730.6079998,46.280490126926502,-1943924437.9100001,-11.9935406197328,-3204488492.3200002,-19.344277264317501,-196.26181767112601,-12.2904325184209,-6.7098939054267204,null,25510402500.096001,727139637.63,19877868105.504002,18676781129.599998,1201086975.9040031,4.7082243249571748E-2,-3580317414.1360002,77.920636906637796,109693.76814425,-9.7793406596320001,136.147385911783,24.743797368893901,null,996987288]
[null,null,null,null,null,null,null,null,null,null,null,null,null,null,null,null,null,null,null,null,null,null,null,null,null,null,null,null,"",""]
[null,null,null,null,null,null,null,null,null,null,null,null,null,null,null,null,null,null,null,null,null,null,null,null,null,null,null,null,"",""]
[null,null,null,null,null,null,null,null,null,null,null,null,null,null,null,null,null,null,null,null,null,null,null,null,null,null,null,null,"",""]
[null,null,null,null,null,null,null,null,null,null,null,null,null,null,null,null,null,null,null,null,null,null,null,null,null,null,null,null,"",""]
[null,null,null,null,null,null,null,null,null,null,null,null,null,null,null,null,null,null,null,null,null,null,null,null,null,null,null,null,"",""]
[null,null,null,null,null,null,null,null,null,null,null,null,null,null,null,null,null,null,null,null,null,null,null,null,null,null,null,null,"",""]
[null,null,null,null,null,null,null,null,null,null,null,null,null,null,null,null,null,null,null,null,null,null,null,null,null,null,null,null,"",""]
[null,null,null,null,null,null,null,null,null,null,null,null,null,null,null,null,null,null,null,null,null,null,null,null,null,null,null,null,"",""]
[null,null,null,null,null,null,null,null,null,null,null,null,null,null,null,null,null,null,null,null,null,null,null,null,null,null,null,null,"",""]
[null,null,null,null,null,null,null,null,null,null,null,null,null,null,null,null,null,null,null,null,null,null,null,null,null,null,null,null,"",""]
[null,null,null,null,null,null,null,null,null,null,null,null,null,null,null,null,null,null,null,null,null,null,null,null,null,null,null,null,"",""]
[null,null,null,null,null,null,null,null,null,null,null,null,null,null,null,null,null,null,null,null,null,null,null,null,null,null,null,null,"",""]
[null,null,null,null,null,null,null,null,null,null,null,null,null,null,null,null,null,null,null,null,null,null,null,null,null,null,null,null,"",""]
[null,null,null,null,null,null,null,null,null,null,null,null,null,null,null,null,null,null,null,null,null,null,null,null,null,null,null,null,"",""]
[null,null,null,null,null,null,null,null,null,null,null,null,null,null,null,null,null,null,null,null,null,null,null,null,null,null,null,null,"",""]
[null,null,null,null,null,null,null,null,null,null,null,null,null,null,null,null,null,null,null,null,null,null,null,null,null,null,null,null,"",""]
[null,null,null,null,null,null,null,null,null,null,null,null,null,null,null,null,null,null,null,null,null,null,null,null,null,null,null,null,"",""]
[null,null,null,null,null,null,null,null,null,null,null,null,null,null,null,null,null,null,null,null,null,null,null,null,null,null,null,null,"",""]
[null,null,null,null,null,null,null,null,null,null,null,null,null,null,null,null,null,null,null,null,null,null,null,null,null,null,null,null,"",""]
[null,null,null,null,null,null,null,null,null,null,null,null,null,null,null,null,null,null,null,null,null,null,null,null,null,null,null,null,"",""]
[null,null,null,null,null,null,null,null,null,null,null,null,null,null,null,null,null,null,null,null,null,null,null,null,null,null,null,null,"",""]
[null,null,null,null,null,null,null,null,null,null,null,null,null,null,null,null,null,null,null,null,null,null,null,null,null,null,null,null,"",""]
[null,null,null,null,null,null,null,null,null,null,null,null,null,null,null,null,null,null,null,null,null,null,null,null,null,null,null,null,"",""]
[null,null,null,null,null,null,null,null,null,null,null,null,null,null,null,null,null,null,null,null,null,null,null,null,null,null,null,null,"",""]
[null,null,null,null,null,null,null,null,null,null,null,null,null,null,null,null,null,null,null,null,null,null,null,null,null,null,null,null,"",""]
[null,null,null,null,null,null,null,null,null,null,null,null,null,null,null,null,null,null,null,null,null,null,null,null,null,null,null,null,"",""]
[null,null,null,null,null,null,null,null,null,null,null,null,null,null,null,null,null,null,null,null,null,null,null,null,null,null,null,null,"",""]
[null,null,null,null,null,null,null,null,null,null,null,null,null,null,null,null,null,null,null,null,null,null,null,null,null,null,null,null,"",""]
[null,null,null,null,null,null,null,null,null,null,null,null,null,null,null,null,null,null,null,null,null,null,null,null,null,null,null,null,"",""]
[null,null,null,null,null,null,null,null,null,null,null,null,null,null,null,null,null,null,null,null,null,null,null,null,null,null,null,null,"",""]
[null,null,null,null,null,null,null,null,null,null,null,null,null,null,null,null,null,null,null,null,null,null,null,null,null,null,null,null,"",""]
[null,null,null,null,null,null,null,null,null,null,null,null,null,null,null,null,null,null,null,null,null,null,null,null,null,null,null,null,"",""]
[null,null,null,null,null,null,null,null,null,null,null,null,null,null,null,null,null,null,null,null,null,null,null,null,null,null,null,null,"",""]
[null,null,null,null,null,null,null,null,null,null,null,null,null,null,null,null,null,null,null,null,null,null,null,null,null,null,null,null,"",""]
[null,null,null,null,null,null,null,null,null,null,null,null,null,null,null,null,null,null,null,null,null,null,null,null,null,null,null,null,"",""]
[null,null,null,null,null,null,null,null,null,null,null,null,null,null,null,null,null,null,null,null,null,null,null,null,null,null,null,null,"",""]
[null,null,null,null,null,null,null,null,null,null,null,null,null,null,null,null,null,null,null,null,null,null,null,null,null,null,null,null,"",""]
[null,null,null,null,null,null,null,null,null,null,null,null,null,null,null,null,null,null,null,null,null,null,null,null,null,null,null,null,"",""]
[null,null,null,null,null,null,null,null,null,null,null,null,null,null,null,null,null,null,null,null,null,null,null,null,null,null,null,null,"",""]
[null,null,null,null,null,null,null,null,null,null,null,null,null,null,null,null,null,null,null,null,null,null,null,null,null,null,null,null,"",""]
[null,null,null,null,null,null,null,null,null,null,null,null,null,null,null,null,null,null,null,null,null,null,null,null,null,null,null,null,"",""]
[null,null,null,null,null,null,null,null,null,null,null,null,null,null,null,null,null,null,null,null,null,null,null,null,null,null,null,null,"",""]
{"$rows_left_out":145}
{"sheet":"Base Data","index":2,"n_rows":421,"n_cols":9,"rows_kept":421,"cut":false,"hidden":false,"merged":[]}
[{"$f":"_xll.ECOSECURITIES(\"STOCK\",\"ACTIVE\",,G9,,,,{\"Sector Economatica<>Finanzas y Seguros\";\"Index particip.>0\"})","v":"Codigo"},{"$f":"_xll.ECONOMATICA($A$2:$A$3000,\"name\")","v":"Nombre"},{"$f":"_xll.ECONOMATICA($A$2:$A$3000,\"Class\")","v":"Clase"},"Nombre y Clase","Codigo","Colombia","COL","COLCAPRT<XBOG>",{"$f":"IF(H1=\"S&P 500\",\"S&P 500\", \"COLCAP RT\")","v":"COLCAP RT"}]
["PFAVH<XBOG>","Avianca Holdings S.A.","Pref",{"$f":"CONCATENATE(B2,\" \",C2)","v":"Avianca Holdings S.A. Pref"},{"$f":"A2","v":"PFAVH<XBOG>"},"Chile","CHL","SP IPSA<XSGO>","IPSA"]
["CELSIA<XBOG>","Celsia S.A. e.S.P","Ord",{"$f":"CONCATENATE(B3,\" \",C3)","v":"Celsia S.A. e.S.P Ord"},{"$f":"A3","v":"CELSIA<XBOG>"},"Estados Unidos","USA","S&P 500","S&P 500"]
["CEMARGOS<XBOG>","Cementos Argos","Ord","Cementos Argos Ord","CEMARGOS<XBOG>","Argentina","ARG","MERVAL<XBUE>","MERVAL"]
["PFCEMARGOS<XBOG>","Cementos Argos","Pref","Cementos Argos Pref","PFCEMARGOS<XBOG>","Perú","PER","SPBL25PT<XLIM>","BVL 25"]
["CLH<XBOG>","Cemex Latam Holdings","Ord","Cemex Latam Holdings Ord","CLH<XBOG>","Brasil","BRA","IBOV<XBSP>","BOVESPA"]
["CONCONCRET<XBOG>","Constructora Conconcreto S.A.","Ord","Constructora Conconcreto S.A. Ord","CONCONCRET<XBOG>","México","MEX","IPyC<XMEX>","IP Y C"]
["ECOPETROL<XBOG>","Ecopetrol","Ord","Ecopetrol Ord","ECOPETROL<XBOG>"]
["ETB<XBOG>","Emp.Telec.Bogota","Ord","Emp.Telec.Bogota Ord","ETB<XBOG>",{"$f":"'Fundamental Analysis'!B8","v":"Colombia"},{"$f":"VLOOKUP($F$9,$F$1:$H$7,2,FALSE)","v":"COL"},{"$f":"VLOOKUP($F$9,$F$1:$H$7,3,FALSE)","v":"COLCAPRT<XBOG>"}]
["EXITO<XBOG>","Exito","Ord","Exito Ord","EXITO<XBOG>"]
["PFAVAL<XBOG>","Grupo Aval Ac Va","Pref","Grupo Aval Ac Va Pref","PFAVAL<XBOG>"]
["GRUPOSURA<XBOG>","Grupo de Inversiones Suramericana","Ord","Grupo de Inversiones Suramericana Ord","GRUPOSURA<XBOG>"]
["PFGRUPSURA<XBOG>","Grupo de Inversiones Suramericana","Pref","Grupo de Inversiones Suramericana Pref","PFGRUPSURA<XBOG>"]
["GEB<XBOG>","Grupo Energia Bogota S.A. Esp","Ord","Grupo Energia Bogota S.A. Esp Ord","GEB<XBOG>"]
["ISA<XBOG>","Interconexion Electrica S.A. Esp","Ord","Interconexion Electrica S.A. Esp Ord","ISA<XBOG>"]
["NUTRESA<XBOG>","Nutresa","Ord","Nutresa Ord","NUTRESA<XBOG>"]
[null,null,null," ",0]
[null,null,null," ",0]
[null,null,null," ",0]
[null,null,null," ",0]
[null,null,null," ",0]
[null,null,null," ",0]
[null,null,null," ",0]
[null,null,null," ",0]
[null,null,null," ",0]
[null,null,null," ",0]
[null,null,null," ",0]
[null,null,null," ",0]
[null,null,null," ",0]
[null,null,null," ",0]
[null,null,null," ",0]
[null,null,null," ",0]
[null,null,null," ",0]
[null,null,null," ",0]
[null,null,null," ",0]
[null,null,null," ",0]
[null,null,null," ",0]
[null,null,null," ",0]
[null,null,null," ",0]
[null,null,null," ",0]
[null,null,null," ",0]
[null,null,null," ",0]
[null,null,null," ",0]
[null,null,null," ",0]
[null,null,null," ",0]
[null,null,null," ",0]
[null,null,null," ",0]
[null,null,null," ",0]
[null,null,null," ",0]
[null,null,null," ",0]
[null,null,null," ",0]
[null,null,null," ",0]
[null,null,null," ",0]
[null,null,null," ",0]
[null,null,null," ",0]
[null,null,null," ",0]
[null,null,null," ",0]
[null,null,null," ",0]
[null,null,null," ",0]
[null,null,null," ",0]
{"$rows_left_out":361}