{"text_format":"1","workbook":"xlsx","n_sheets":4,"sheets":["Factsheet","Multiples","Dividends","Base Factsheet"],"not_rendered":{"charts":1,"images":1,"macros":1,"external_links":0,"defined_names":57,"comments":0,"pivot_tables":0},"unopened":[],"bounds":{"document_bytes":16777216,"sheet_cells":100000,"rows_first":2000,"rows_last":500,"rows_between":2000,"halvings":0,"cell_chars":16384,"cell_head_chars":4096},"cells_cut":0,"cells_raw":0,"read":"whole","date_system":"1900"}

{"sheet":"Factsheet","index":0,"n_rows":57,"n_cols":32,"rows_kept":57,"cut":false,"hidden":false,"merged":[[53,22,54,23],[53,24,54,25],[39,22,39,25],[45,15,46,17],[47,15,48,17],[49,15,50,17],[51,15,52,17],[53,15,54,17],[43,18,44,19],[53,18,54,19],[43,20,44,21],[53,20,54,21],[49,22,50,23],[49,24,50,25],[51,22,52,23],[51,24,52,25],[47,18,48,19],[47,20,48,21],[47,22,48,23],[47,24,48,25],[45,18,46,19],[45,20,46,21],[45,22,46,23],[45,24,46,25],[54,1,54,3],[54,4,54,5],[54,6,54,7],[54,8,54,9],[53,8,53,9],[51,1,51,3],[51,4,51,6],[51,7,51,9],[52,1,52,3],[52,4,52,5],[52,6,52,7],[52,8,52,9],[49,18,50,19],[49,20,50,21],[51,18,52,19],[51,20,52,21],[53,1,53,3],[53,4,53,5],[53,6,53,7],[49,1,49,3],[49,4,49,5],[49,6,49,7],[49,8,49,9],[50,1,50,3],[50,4,50,5],[50,6,50,7],[50,8,50,9],[48,1,48,3],[48,4,48,5],[48,6,48,7],[48,8,48,9],[46,1,46,3],[46,4,46,5],[46,6,46,7],[46,8,46,9],[43,24,44,25],[45,1,45,3],[45,4,45,5],[45,6,45,7],[45,8,45,9],[44,1,44,3],[44,4,44,5],[44,6,44,7],[44,8,44,9],[43,15,44,17],[43,22,44,23],[41,24,42,25],[43,1,43,3],[43,4,43,5],[43,6,43,7],[43,8,43,9],[42,1,42,3],[42,4,42,5],[42,6,42,7],[42,8,42,9],[41,18,42,19],[41,20,42,21],[41,22,42,23],[41,15,42,17],[41,1,41,3],[41,4,41,5],[41,6,41,7],[41,8,41,9],[40,18,40,19],[40,20,40,21],[40,22,40,23],[40,24,40,25],[40,1,40,3],[40,4,40,5],[40,6,40,7],[40,8,40,9],[39,18,39,21],[38,1,38,3],[38,4,38,5],[38,6,38,7],[38,8,38,9],[39,1,39,3],[39,4,39,5],[39,6,39,7],[39,8,39,9],[36,1,36,3],[36,4,36,5],[36,6,36,7],[36,8,36,9],[37,1,37,3],[37,4,37,5],[37,6,37,7],[37,8,37,9],[34,1,34,3],[34,4,34,5],[34,6,34,7],[34,8,34,9],[35,1,35,3],[35,4,35,5],[35,6,35,7],[35,8,35,9],[32,1,32,3],[32,4,32,5],[32,6,32,7],[32,8,32,9],[33,1,33,3],[33,4,33,5],[33,6,33,7],[33,8,33,9],[30,1,30,3],[30,4,30,5],[30,6,30,7],[30,8,30,9],[31,1,31,3],[31,4,31,5],[31,6,31,7],[31,8,31,9],[27,8,27,9],[28,4,28,5],[28,6,28,7],[28,8,28,9],[29,1,29,3],[29,4,29,5],[29,6,29,7],[29,8,29,9],[24,1,24,3],[24,4,24,5],[24,6,24,7],[24,8,24,9],[25,1,25,3],[25,4,25,5],[25,6,25,7],[25,8,25,9],[22,1,22,3],[22,4,22,5],[22,6,22,7],[22,8,22,9],[23,1,23,3],[23,4,23,5],[23,6,23,7],[23,8,23,9],[20,1,20,3],[20,4,20,5],[20,6,20,7],[20,8,20,9],[21,1,21,3],[21,4,21,5],[21,6,21,7],[21,8,21,9],[18,1,18,3],[18,4,18,5],[18,6,18,7],[18,8,18,9],[19,1,19,3],[19,4,19,5],[19,6,19,7],[19,8,19,9],[16,1,16,3],[16,4,16,5],[16,6,16,7],[16,8,16,9],[17,1,17,3],[17,4,17,5],[17,6,17,7],[17,8,17,9],[12,28,12,29],[14,1,14,3],[14,4,14,5],[14,6,14,7],[14,8,14,9],[15,1,15,3],[15,4,15,5],[15,6,15,7],[15,8,15,9],[13,1,13,3],[12,11,12,13],[12,14,12,15],[12,16,12,17],[12,18,12,19],[12,20,12,21],[12,22,12,23],[12,1,12,3],[12,4,12,5],[12,6,12,7],[12,8,12,9],[11,11,11,13],[11,14,11,15],[11,28,11,29],[11,16,11,17],[11,18,11,19],[11,20,11,21],[11,22,11,23],[11,24,11,25],[11,26,11,27],[11,1,11,3],[11,4,11,5],[11,6,11,7],[11,8,11,9],[10,1,10,3],[10,4,10,5],[10,6,10,7],[10,8,10,9],[9,11,9,13],[9,14,9,15],[9,28,9,29],[9,16,9,17],[9,18,9,19],[9,20,9,21],[9,22,9,23],[9,24,9,25],[9,26,9,27],[9,4,9,5],[9,6,9,7],[9,8,9,9],[10,22,10,23],[10,24,10,25],[10,26,10,27],[10,28,10,29],[10,11,10,13],[8,1,8,3],[8,4,8,5],[8,6,8,7],[8,8,8,9],[8,11,8,13],[8,14,8,15],[8,28,8,29],[9,1,9,3],[8,22,8,23],[8,24,8,25],[8,26,8,27],[8,16,8,17],[8,18,8,19],[8,20,8,21],[14,28,14,29],[2,28,2,29],[4,5,4,6],[6,8,6,9],[7,4,7,5],[7,6,7,7],[7,8,7,9],[7,14,7,15],[7,16,7,17],[7,18,7,19],[7,20,7,21],[7,22,7,23],[7,24,7,25],[7,26,7,27],[7,28,7,29],[7,11,7,13],[10,14,10,15],[10,16,10,17],[10,18,10,19],[10,20,10,21],[12,24,12,25],[12,26,12,27]]}
[]
[]
[null,"Factsheet  (nonfinancials)",null,null,null,null,null,null,null,null,null,null,null,null,null,null,null,null,null,null,null,null,null,null,null,null,null,"Date:",{"$f":"IF(AF3=\"\",_xll.ECONOMATICA('Base Factsheet'!M7,\"Date of Last Quote\"),AF3)","v":"2020-05-08"},null,null,"2020-05-08"]
[]
[null,"Avianca Holdings S.A. Pref",null,null,null,{"$f":"VLOOKUP(B5,'Base Factsheet'!I7:J3000,2,FALSE)","v":"PFAVH<XBOG>"},null,"Colombia",null,null,null,null,null,null,null,null,null,null,null,null,null,null,null,null,null,null,null,null,null,{"$f":"IFERROR(UPPER(_xll.ECONOMATICA($F$5,\"name\")&\" \"&_xll.ECONOMATICA($F$5,\"class\")&\"   |    NAICS SECTOR: \"&_xll.ECONOMATICA($F$5,\"SECTOR NAICS\")),\"\")","v":"AVIANCA HOLDINGS S.A. PREF   |    NAICS SECTOR: TRANSPORTE AÉREO REGULAR"}]
[]
[null,"MARKET HIGHLIGHTS",null,null,null,null,null,null,"Thousands",null,null,"RETURNS TABLE"]
[null,null,null,null,{"$f":"AC3","v":"2020-05-08"},null,{"$f":"IFERROR(DATE(YEAR($E$8)-1,12,31),\"\")","v":"2019-12-31"},null,{"$f":"IFERROR(DATE(YEAR($E$8)-2,12,31),\"\")","v":"2018-12-31"},null,null,null,null,null,"1D",null,"1M",null,"6M",null,"12M",null,"24M",null,"36M",null,"48M",null,"60M"]
[null,"Close",null,null,{"$f":"IFERROR(_xll.ECONOMATICA($F$5,\"close\",,E$8,,,,,,,,{\"tc.pers=3\"}),\"\")","v":450},null,{"$f":"IFERROR(_xll.ECONOMATICA($F$5,\"close\",,G$8,,,,,,,,{\"tc.pers=3\"}),\"\")","v":1835},null,{"$f":"IFERROR(_xll.ECONOMATICA($F$5,\"close\",,I$8,,,,,,,,{\"tc.pers=3\"}),\"\")","v":1597.1239102054401},null,null,"Return",null,null,{"$f":"IFERROR(_xll.ECONOMATICA($F$5,\"RETURN\",O$8,$AC$3,,,,\"decimal\"),\"\")","v":2.2727272727934199E-2},null,{"$f":"IFERROR(_xll.ECONOMATICA($F$5,\"RETURN\",Q$8,$AC$3,,,,\"decimal\"),\"\")","v":-8.1632653061242302E-2},null,{"$f":"IFERROR(_xll.ECONOMATICA($F$5,\"RETURN\",S$8,$AC$3,,,,\"decimal\"),\"\")","v":-0.76253298153052995},null,{"$f":"IFERROR(_xll.ECONOMATICA($F$5,\"RETURN\",U$8,$AC$3,,,,\"decimal\"),\"\")","v":-0.68397584776976195},null,{"$f":"IFERROR(_xll.ECONOMATICA($F$5,\"RETURN\",W$8,$AC$3,,,,\"decimal\"),\"\")","v":-0.82603180002071896},null,{"$f":"IFERROR(_xll.ECONOMATICA($F$5,\"RETURN\",Y$8,$AC$3,,,,\"decimal\"),\"\")","v":-0.811021838572342},null,{"$f":"IFERROR(_xll.ECONOMATICA($F$5,\"RETURN\",AA$8,$AC$3,,,,\"decimal\"),\"\")","v":-0.752395836919313},null,{"$f":"IFERROR(_xll.ECONOMATICA($F$5,\"RETURN\",AC$8,$AC$3,,,,\"decimal\"),\"\")","v":-0.85328857217915399}]
[null,"High",null,null,{"$f":"IFERROR(_xll.ECONOMATICA($F$5,\"High\",\"in the year\",E$8,,,),\"\")","v":2120},null,{"$f":"IFERROR(_xll.ECONOMATICA($F$5,\"High\",\"in the year\",G$8,,,),\"\")","v":1995},null,{"$f":"IFERROR(_xll.ECONOMATICA($F$5,\"High\",\"in the year\",I$8,,,),\"\")","v":3175.8166335597598},null,null,{"$f":"CONCATENATE(\"Benchmark (\",'Base Factsheet'!N15,\")\")","v":"Benchmark (COLCAP RT)"},null,null,{"$f":"IFERROR(_xll.ECONOMATICA(\"S&P 500\",\"RETURN\",O8,$AC$3,,,,\"decimal\"),\"\")","v":1.68715010113374E-2},null,{"$f":"IFERROR(_xll.ECONOMATICA(\"COLCAPRT<XBOG>\",\"RETURN\",Q8,$AC$3,,,,\"decimal\"),\"\")","v":-4.80822752479435E-2},null,{"$f":"IFERROR(_xll.ECONOMATICA(\"COLCAPRT<XBOG>\",\"RETURN\",S8,$AC$3,,,,\"decimal\"),\"\")","v":-0.29824962208018402},null,{"$f":"IFERROR(_xll.ECONOMATICA(\"COLCAPRT<XBOG>\",\"RETURN\",U8,$AC$3,,,,\"decimal\"),\"\")","v":-0.24379506003606399},null,{"$f":"IFERROR(_xll.ECONOMATICA(\"COLCAPRT<XBOG>\",\"RETURN\",W8,$AC$3,,,,\"decimal\"),\"\")","v":-0.221311300968518},null,{"$f":"IFERROR(_xll.ECONOMATICA(\"COLCAPRT<XBOG>\",\"RETURN\",Y8,$AC$3,,,,\"decimal\"),\"\")","v":-0.118821539263154},null,{"$f":"IFERROR(_xll.ECONOMATICA(\"COLCAPRT<XBOG>\",\"RETURN\",AA8,$AC$3,,,,\"decimal\"),\"\")","v":-2.02127907041358E-2},null,{"$f":"IFERROR(_xll.ECONOMATICA(\"COLCAPRT<XBOG>\",\"RETURN\",AC8,$AC$3,,,,\"decimal\"),\"\")","v":-3.2991441338708703E-2}]
{"$rows_left_out":48}
{"sheet":"Multiples","index":1,"n_rows":200,"n_cols":55,"rows_kept":200,"cut":false,"hidden":false,"merged":[]}
[]
[null,"Date:",{"$f":"Factsheet!AC3","v":"2020-05-08"},"← Do not modify",null,null,null,"Price / Earnings",null,null,null,null,null,null,null,"EV / EBITDA",null,null,null,null,null,null,null,"D/(D+E)",null,null,null,null,null,null,null,"PRICE / BOOK VALUE",null,null,null,null,null,null,null,null,"PRICE /SALES",null,null,null,null,null,null,null,"NET DEBT / EBITDA"]
[]
[null,null,null,null,null,null,null,{"$f":"EOMONTH(I4,-12)","v":"2016-12-31"},{"$f":"EOMONTH(J4,-12)","v":"2017-12-31"},{"$f":"EOMONTH(K4,-12)","v":"2018-12-31"},{"$f":"DATE(YEAR($C$2)-1,12,31)","v":"2019-12-31"},{"$f":"$C$2","v":"2020-05-08"},null,null,null,{"$f":"EOMONTH(Q4,-12)","v":"2016-12-31"},{"$f":"EOMONTH(R4,-12)","v":"2017-12-31"},{"$f":"EOMONTH(S4,-12)","v":"2018-12-31"},{"$f":"DATE(YEAR($C$2)-1,12,31)","v":"2019-12-31"},{"$f":"$C$2","v":"2020-05-08"},null,null,null,{"$f":"EOMONTH(Y4,-12)","v":"2016-12-31"},{"$f":"EOMONTH(Z4,-12)","v":"2017-12-31"},{"$f":"EOMONTH(AA4,-12)","v":"2018-12-31"},{"$f":"DATE(YEAR($C$2)-1,12,31)","v":"2019-12-31"},{"$f":"TEXT($C$2,\"AAAA\")","v":"viernes"},null,null,null,{"$f":"EOMONTH(AG4,-12)","v":"2016-12-31"},{"$f":"EOMONTH(AH4,-12)","v":"2017-12-31"},{"$f":"EOMONTH(AI4,-12)","v":"2018-12-31"},{"$f":"DATE(YEAR($C$2)-1,12,31)","v":"2019-12-31"},{"$f":"$C$2","v":"2020-05-08"},null,null,null,null,{"$f":"EOMONTH(AP4,-12)","v":"2016-12-31"},{"$f":"EOMONTH(AQ4,-12)","v":"2017-12-31"},{"$f":"EOMONTH(AR4,-12)","v":"2018-12-31"},{"$f":"DATE(YEAR($C$2)-1,12,31)","v":"2019-12-31"},{"$f":"$C$2","v":"2020-05-08"},null,null,null,{"$f":"EOMONTH(AX4,-12)","v":"2016-12-31"},{"$f":"EOMONTH(AY4,-12)","v":"2017-12-31"},{"$f":"EOMONTH(AZ4,-12)","v":"2018-12-31"},{"$f":"DATE(YEAR($C$2)-1,12,31)","v":"2019-12-31"},"LATEST"]
[null,{"$f":"_xll.ECOSECURITIES(\"stock\",\"active\",\"true\",\"USA;COL;CHL;MEX;PER;BRA;ARG\",\"XNYS;XNAS;XBOG;XSGO;XBUE;XBSP;XLIM;XMEX\",,,\"SECTOR NAICS=\"&SUBSTITUTE(_xll.ECONOMATICA(Factsheet!F5,\"SECTOR NAICS\"),\",\",\"\\,\"))","v":"Codigo"},{"$f":"_xll.ECONOMATICA($B$6:$B$200,\"name\")","v":"Nombre"},{"$f":"_xll.ECONOMATICA($B$6:$B$200,\"SECTOR NAICS\",,,,,,,,,\"SECTOR NAICS\")","v":"SECTOR NAICS"},{"$f":"_xll.ECONOMATICA($B$6:$B$200,\"Ticker\",,,,,,,,,\"Ticker (cleaned)\")","v":"Ticker (cleaned)"},{"$f":"_xll.ECONOMATICA(B6:B200,\"MarketCapitaliz\",,$C$2,,,\"USD\",\"millions\",,,\"Mkt Cap (millions)\")","v":"Mkt Cap (millions)"},null,{"$f":"_xll.ECONOMATICA($B$6:$B$200,\"P/E\",\"12m\",H4,,,\"USD\",,,,\"P/E\")","v":"P/E"},{"$f":"_xll.ECONOMATICA($B$6:$B$200,\"P/E\",\"12m\",I4,,,\"USD\",,,,\"P/E\")","v":"P/E"},{"$f":"_xll.ECONOMATICA($B$6:$B$200,\"P/E\",\"12m\",J4,,,\"USD\",,,,\"P/E\")","v":"P/E"},{"$f":"_xll.ECONOMATICA($B$6:$B$200,\"P/E\",\"12m\",K4,,,\"USD\",,,,\"P/E\")","v":"P/E"},{"$f":"_xll.ECONOMATICA($B$6:$B$200,\"P/E\",\"12m\",L4,,,\"USD\",,,,\"P/E\")","v":"P/E"},"Median 5 years","Average 5 years\n(values >0 e <50)",null,{"$f":"_xll.ECONOMATICA($B$6:$B$200,\"EV/EBITDA co\",\"12m\",P4,,,\"USD\",,,,\"EV/EBITDA\")","v":"EV/EBITDA"},{"$f":"_xll.ECONOMATICA($B$6:$B$200,\"EV/EBITDA co\",\"12m\",Q4,,,\"USD\",,,,\"EV/EBITDA\")","v":"EV/EBITDA"},{"$f":"_xll.ECONOMATICA($B$6:$B$200,\"EV/EBITDA co\",\"12m\",R4,,,\"USD\",,,,\"EV/EBITDA\")","v":"EV/EBITDA"},{"$f":"_xll.ECONOMATICA($B$6:$B$200,\"EV/EBITDA co\",\"12m\",S4,,,\"USD\",,,,\"EV/EBITDA\")","v":"EV/EBITDA"},{"$f":"_xll.ECONOMATICA($B$6:$B$200,\"EV/EBITDA co\",\"12m\",T4,,,\"USD\",,,,\"EV/EBITDA\")","v":"EV/EBITDA"},"Median 5 years","Average 5 years\n(values >0 e <50)",null,{"$f":"_xll.ECONOMATICA($B$6:$B$200,\"Cap Str(Mkt Cap)\",,X4,,,\"USD\",\"decimal\",,,\"D/D+E\")","v":"D/D+E"},{"$f":"_xll.ECONOMATICA($B$6:$B$200,\"Cap Str(Mkt Cap)\",,Y4,,,\"USD\",\"decimal\",,,\"D/D+E\")","v":"D/D+E"},{"$f":"_xll.ECONOMATICA($B$6:$B$200,\"Cap Str(Mkt Cap)\",,Z4,,,\"USD\",\"decimal\",,,\"D/D+E\")","v":"D/D+E"},{"$f":"_xll.ECONOMATICA($B$6:$B$200,\"Cap Str(Mkt Cap)\",,AA4,,,\"USD\",\"decimal\",,,\"D/D+E\")","v":"D/D+E"},{"$f":"_xll.ECONOMATICA($B$6:$B$200,\"Cap Str(Mkt Cap)\",,$C$2,,,\"USD\",\"decimal\",,,\"D/D+E\")","v":"D/D+E"},"Median 5 years","Average 5 years",null,{"$f":"_xll.ECONOMATICA($B$6:$B$200,\"P/BV\",,AF4,,,\"USD\",,,,\"P/B\")","v":"P/B"},{"$f":"_xll.ECONOMATICA($B$6:$B$200,\"P/BV\",,AG4,,,\"USD\",,,,\"P/B\")","v":"P/B"},{"$f":"_xll.ECONOMATICA($B$6:$B$200,\"P/BV\",,AH4,,,\"USD\",,,,\"P/B\")","v":"P/B"},{"$f":"_xll.ECONOMATICA($B$6:$B$200,\"P/BV\",,AI4,,,\"USD\",,,,\"P/B\")","v":"P/B"},{"$f":"_xll.ECONOMATICA($B$6:$B$200,\"P/BV\",,AJ4,,,\"USD\",,,,\"P/B\")","v":"P/B"},"High 5 years","P/B atual vs High 5 years","Average 5 years\n(values >0 e <30)",null,{"$f":"_xll.ECONOMATICA($B$6:$B$200,\"PSR\",\"12m\",AO4,,,\"USD\",,,,\"P/Sales\")","v":"P/Sales"},{"$f":"_xll.ECONOMATICA($B$6:$B$200,\"PSR\",\"12m\",AP4,,,\"USD\",,,,\"P/Sales\")","v":"P/Sales"},{"$f":"_xll.ECONOMATICA($B$6:$B$200,\"PSR\",\"12m\",AQ4,,,\"USD\",,,,\"P/Sales\")","v":"P/Sales"},{"$f":"_xll.ECONOMATICA($B$6:$B$200,\"PSR\",\"12m\",AR4,,,\"USD\",,,,\"P/Sales\")","v":"P/Sales"},{"$f":"_xll.ECONOMATICA($B$6:$B$200,\"PSR\",\"12m\",AS4,,,\"USD\",,,,\"P/Sales\")","v":"P/Sales"},"Median 5 years","Average 5 years\n(values >0 e <50)",null,{"$f":"_xll.ECONOMATICA($B$6:$B$200,\"NetDebt/Ebitda\",\"12m\",AW4,,,\"USD\",,,,\"NetDebt/EBITDA\")","v":"NetDebt/EBITDA"},{"$f":"_xll.ECONOMATICA($B$6:$B$200,\"NetDebt/Ebitda\",\"12m\",AX4,,,\"USD\",,,,\"NetDebt/EBITDA\")","v":"NetDebt/EBITDA"},{"$f":"_xll.ECONOMATICA($B$6:$B$200,\"NetDebt/Ebitda\",\"12m\",AY4,,,\"USD\",,,,\"NetDebt/EBITDA\")","v":"NetDebt/EBITDA"},{"$f":"_xll.ECONOMATICA($B$6:$B$200,\"NetDebt/Ebitda\",\"12m\",AZ4,,,\"USD\",,,,\"NetDebt/EBITDA\")","v":"NetDebt/EBITDA"},{"$f":"_xll.ECONOMATICA($B$6:$B$200,\"NetDebt/Ebitda\",\"12m\",BA4,,,\"USD\",,,,\"NetDebt/EBITDA\")","v":"NetDebt/EBITDA"},"Median 5 years","Average 5 years\n(values >0 e <50)"]
[null,"ALK<XNYS>","Alaska Air Group, Inc","Transporte aéreo regular","ALK",3695.2027800000001,null,13.5672782874608,8.8035928143654001,17.286931818176502,10.945072697897601,4.8465266558923803,{"$f":"IFERROR(MEDIAN(H6:L6),\"-x-\")","v":10.945072697897601},{"$f":"IFERROR(AVERAGEIFS(H6:L6,H6:L6,\">0\",H6:L6,\"<50\"),\"-x-\")","v":11.089880454758537},null,7.1973543813583101,6.1231803789633004,8.0401523638283798,6.7503362123170501,3.6212670121130901,{"$f":"IFERROR(MEDIAN(P6:T6),\"-x-\")","v":6.7503362123170501},{"$f":"IFERROR(AVERAGEIFS(P6:T6,P6:T6,\">0\",P6:T6,\"<50\"),\"-x-\")","v":6.3464580697160269},null,0.21320871584641299,0.221197974887618,0.218930261316127,0.27761427526420501,0.464634277233272,{"$f":"IFERROR(MEDIAN(X6:AB6),\"-x-\")","v":0.221197974887618},{"$f":"IFERROR(AVERAGE(X6:AB6),\"-x-\")","v":0.27911710090952696},null,3.73178802486655,2.4308063365970201,2.0002129060885601,1.9268066523891301,0.85319851766325905,{"$f":"IF(MAX(AF6:AJ6)=0,\"-x-\",MAX(AF6:AJ6))","v":3.73178802486655},{"$f":"IFERROR(AJ6/AK6,\"-x-\")","v":0.22862995217788923},{"$f":"IFERROR(AVERAGEIFS(AF6:AJ6,AF6:AJ6,\">0\",AF6:AJ6,\"<30\"),\"-x-\")","v":2.1885624875209038},null,1.85229968893145,1.14363202686582,0.90682679074325301,0.95102119774855998,0.42111639752692998,{"$f":"IFERROR(MEDIAN(AO6:AS6),\"-x-\")","v":0.95102119774855998},{"$f":"IFERROR(AVERAGEIFS(AO6:AS6,AO6:AS6,\">0\",AO6:AS6,\"<50\"),\"-x-\")","v":1.0549792203632025},null,0.80841121495359403,0.58088235294144397,0.83285302593685595,1.1345895020185699,1.1345895020185699,{"$f":"IFERROR(MEDIAN(AW6:BA6),\"-x-\")","v":0.83285302593685595},{"$f":"IFERROR(AVERAGEIFS(AW6:BA6,AW6:BA6,\">0\",AW6:BA6,\"<50\"),\"-x-\")","v":0.89826511957380684}]
[null,"ALGT<XNAS>","Allegiant Travel Co","Transporte aéreo regular","ALGT",1234.4919394101601,null,12.5965177895414,12.971500419123901,10.021999999997201,12.204768583454999,5.2882187938303096,12.204768583454999,{"$f":"IFERROR(AVERAGEIFS(H7:L7,H7:L7,\">0\",H7:L7,\"<50\"),\"-x-\")","v":10.616601117189562},null,6.7598511060496103,9.2531626053969394,6.6931835506547896,7.3083183402923204,4.2295507508824803,6.7598511060496103,{"$f":"IFERROR(AVERAGEIFS(P7:T7,P7:T7,\">0\",P7:T7,\"<50\"),\"-x-\")","v":6.8488132706552278},null,0.22694431906769799,0.31889089764852502,0.43985276566236298,0.334027495599585,0.53526670384802899,0.334027495599585,0.37099643636523999,null,5.8132393106643603,4.5406880916416403,2.34606329449525,3.20846390295628,1.39019916640973,5.8132393106643603,0.23914363268331584,{"$f":"IFERROR(AVERAGEIFS(AF7:AJ7,AF7:AJ7,\">0\",AF7:AJ7,\"<30\"),\"-x-\")","v":3.4597307532334525},null,2.02707142665531,1.68406335612053,0.969373006295427,1.5386762265607099,0.66669486465707495,1.5386762265607099,{"$f":"IFERROR(AVERAGEIFS(AO7:AS7,AO7:AS7,\">0\",AO7:AS7,\"<50\"),\"-x-\")","v":1.3771757760578105},null,0.99336491699887097,2.1492809195988198,2.3490491134907598,1.85462349125191,1.85462349125191,1.85462349125191,{"$f":"IFERROR(AVERAGEIFS(AW7:BA7,AW7:BA7,\">0\",AW7:BA7,\"<50\"),\"-x-\")","v":1.8401883865184541}]
[null,"AAL<XNAS>","American Airlines Group Inc","Transporte aéreo regular","AAL",4320.2356641562501,null,9.7068607068649708,13.341025641028001,10.5973597359698,7.5672823218992598,-5.4516129032053904,9.7068607068649708,10.303132101440507,null,5.9386459495508497,7.3901739536231599,7.1655806390335801,6.1401639621544701,null,6.6528723005940247,6.6586411260905152,null,0.50157345871033598,0.50168823878513602,0.62332105392008097,0.65932720366283304,0.85306438212632196,0.62332105392008097,0.6277948674409416,null,6.3913509996418698,6.3413924524211298,-87.510477969888598,-106.470361087122,-1.63893613966684,6.3913509996418698,-0.25643031336546457,6.3663717260314998,null,0.65537531990958098,0.60855669808552204,0.33657544828838598,0.27973991898761602,0.102230894858167,0.33657544828838598,0.3964956560258544,null,2.5323852435940402,3.2920164609058702,4.0940809968815302,3.8062418725603502,null,3.5491291667331102,3.431181143485448]
[null,"PFAVH<XBOG>","Avianca Holdings S.A.","Transporte aéreo regular","PFAVH",114.317672797363,null,69.998343140818207,20.603485556639502,-20.532580928207601,-0.57311000003937795,-0.11751271099274201,-0.11751271099274201,20.603485556639502,null,9.0347562697570503,7.97514950457116,8.0303290160227299,144.36652139387999,133.72393644764099,9.0347562697570503,8.34674493011698,null,0.76815125465276701,0.81684575022780304,0.90641836959868705,0.91542363437009,0.98140811594552402,0.90641836959868705,0.87764942495897424,null,0.84867135200875099,0.702045232080309,0.44070208886296303,2.5256832455779699,0.51787594925372105,2.5256832455779699,0.20504390254020624,1.0069955735567429,null,0.28720995397907201,0.223755299295362,0.104127439465742,0.11330908527349901,2.3233337037737601E-2,0.11330908527349901,0.1503270230102825,null,6.7463334444328202,6.4630998407155902,7.4973049248364996,136.14738591248201,136.14738591248201,7.4973049248364996,6.9022460699949697]
[null,"AZUL4<XBSP>","Azul S.A.","Transporte aéreo regular","AZUL4",806.15821927831996,null,null,15.933242610146401,28.840583704790301,-8.25069849632564,-1.3460731043160199,7.2935847529151907,22.386913157468349,null,null,9.1500958492106292,16.703309780714299,8.7761492074496292,2.0430949803921998,8.9631225283301283,9.1681624544416884,null,null,0.27996512524172401,0.23322662344318801,0.15012332388461799,0.51985759578761603,0.25659587434245601,0.29579316708928649,null,null,3.1675310810242099,3.8512490033826898,-5.6595524815420504,-0.92333653705190999,3.8512490033826898,-0.23974989314918627,3.5093900422034499,null,null,1.0821374906790899,1.32421733334559,1.73279048699442,0.28269881283313197,1.20317741201234,1.1054610309630579,null,4.80368311058555,1.4445327751891499,2.3748609396170699,0.73047008181038098,0.73047008181038098,1.4445327751891499,2.0168033978025064]
{"$rows_left_out":191}
{"sheet":"Dividends","index":2,"n_rows":197,"n_cols":19,"rows_kept":197,"cut":false,"hidden":false,"merged":[[4,13,4,14],[4,5,4,6],[4,7,4,8],[4,9,4,10],[4,11,4,12]]}
[]
[null,"Date:",{"$f":"Factsheet!AC3","v":"2020-05-08"},"← Do not modify"]
[null,null,null,null,null,"DIVIDENDS ANNUALIZED"]
[]
[null,null,null,null,null,{"$f":"EOMONTH(H5,-12)","v":"2016-12-31"},null,{"$f":"EOMONTH(J5,-12)","v":"2017-12-31"},null,{"$f":"EOMONTH(L5,-12)","v":"2018-12-31"},null,{"$f":"DATE(YEAR(N5)-1,12,31)","v":"2019-12-31"},null,{"$f":"$C$2","v":"2020-05-08"},null,"Last 5 Years Indicators"]
[null,{"$f":"_xll.ECOSECURITIES(\"stock\",\"active\",\"true\",\"USA;COL;CHL;MEX;PER;ARG;BRA\",\"xnys;xnas;xbog;xsgo;XLIM;XMEX;XBSP;XBUE\",,,\"SECTOR NAICS=\"&SUBSTITUTE(_xll.ECONOMATICA(Factsheet!F5,\"SECTOR NAICS\"),\",\",\"\\,\"))","v":"Codigo"},{"$f":"_xll.ECONOMATICA($B$7:$B$195,\"name\")","v":"Nombre"},{"$f":"_xll.ECONOMATICA($B$7:$B$198,\"SECTOR NAICS\",,,,,,,,,\"SECTOR NAICS\")","v":"SECTOR NAICS"},{"$f":"_xll.ECONOMATICA($B$7:$B$198,\"Ticker\",,,,,,,,,\"Ticker\")","v":"Ticker"},{"$f":"_xll.ECONOMATICA($B$7:$B$195,\"Div Yld (start)\",,F5,,,\"usd\",\"DECIMAL\",,,\"% Dividend Yield\")","v":"% Dividend Yield"},{"$f":"_xll.ECONOMATICA($B$7:$B$195,\"Divid per Share\",,F5,,,\"usd\",,,,\"$\")","v":"$"},{"$f":"_xll.ECONOMATICA($B$7:$B$195,\"Div Yld (start)\",,H5,,,\"usd\",\"DECIMAL\",,,\"% Dividend Yield\")","v":"% Dividend Yield"},{"$f":"_xll.ECONOMATICA($B$7:$B$195,\"Divid per Share\",,H5,,,\"USD\",,,,\"$\")","v":"$"},{"$f":"_xll.ECONOMATICA($B$7:$B$195,\"Div Yld (start)\",,J5,,,\"USD\",\"DECIMAL\",,,\"% Dividend Yield\")","v":"% Dividend Yield"},{"$f":"_xll.ECONOMATICA($B$7:$B$195,\"Divid per Share\",,J5,,,\"USD\",,,,\"$\")","v":"$"},{"$f":"_xll.ECONOMATICA($B$7:$B$195,\"Div Yld (start)\",,L5,,,\"USD\",\"DECIMAL\",,,\"% Dividend Yield\")","v":"% Dividend Yield"},{"$f":"_xll.ECONOMATICA($B$7:$B$195,\"Divid per Share\",,L5,,,\"USD\",,,,\"$\")","v":"$"},{"$f":"_xll.ECONOMATICA($B$7:$B$195,\"Div Yld (start)\",,N5,,,\"USD\",\"DECIMAL\",,,\"% Dividend Yield\")","v":"% Dividend Yield"},{"$f":"_xll.ECONOMATICA($B$7:$B$195,\"Divid per Share\",,N5,,,\"USD\",,,,\"$\")","v":"$"},"AVG","Median","Max","Min"]
[null,"ALK<XNYS>","Alaska Air Group, Inc","Transporte aéreo regular","ALK",1.36628990187637E-2,1.10000000000036,1.35241744618725E-2,1.20000000000073,1.7412596925587401E-2,1.28000000000065,2.30073952341627E-2,1.39999999999964,2.3479980227384699E-2,1.4250000000010901,{"$f":"IF(MAX(,,F7,H7,J7,L7,N7)=0,\"\",AVERAGE(,,F7,H7,J7,L7,N7))","v":1.3012435123967285E-2},{"$f":"IF(MAX(,,F7,H7,J7,L7,N7)=0,\"\",MEDIAN(,,F7,H7,J7,L7,N7))","v":1.36628990187637E-2},{"$f":"IF(MAX(,,F7,H7,J7,L7,N7)=0,\"\",MAX(,,F7,H7,J7,L7,N7))","v":2.3479980227384699E-2},{"$f":"IF(MAX(,,F7,H7,J7,L7,N7)=0,\"\",MIN(,,F7,H7,J7,L7,N7))","v":0}]
[null,"ALGT<XNAS>","Allegiant Travel Co","Transporte aéreo regular","ALGT",1.43001847107007E-2,2.3999999999978199,1.6826923076932902E-2,2.7999999999992702,1.8093699515338801E-2,2.7999999999992702,2.7938535222528999E-2,2.7999999999992702,1.9700274396691399E-2,2.7999999999992702,1.3837088131741828E-2,{"$f":"IF(MAX(,,F8,H8,J8,L8,N8)=0,\"\",MEDIAN(,,F8,H8,J8,L8,N8))","v":1.6826923076932902E-2},2.7938535222528999E-2,0]
[null,"AAL<XNAS>","American Airlines Group Inc","Transporte aéreo regular","AAL",9.4451003541962605E-3,0.400000000000091,8.5671449989331502E-3,0.400000000000091,7.6878723813206297E-3,0.400000000000091,1.24571784490763E-2,0.400000000000091,8.8888888888868697E-3,0.30000000000018201,6.7208835817733157E-3,8.5671449989331502E-3,1.24571784490763E-2,0]
[null,"PFAVH<XBOG>","Avianca Holdings S.A.","Transporte aéreo regular","PFAVH",3.1312920866184903E-2,1.6821458049918199E-2,2.1548974199904501E-2,2.5689900758891299E-2,3.3726946321912699E-2,3.3481453495085099E-2,2.92627922237443E-2,1.4832392906100699E-2,3.2960082509125598E-2,1.4832392906100699E-2,2.1258816588695998E-2,2.92627922237443E-2,3.3726946321912699E-2,0]
{"$rows_left_out":188}
{"sheet":"Base Factsheet","index":3,"n_rows":2794,"n_cols":14,"rows_kept":2794,"cut":false,"hidden":false,"merged":[]}
["Please do not modify - Pivot table"]
["Start date:",{"$f":"_xll.ECONOMATICA(B5,\"Series Start Date\")","v":"2012-01-03"}]
["Period:",{"$f":"IF(Factsheet!AC15=\"DESDE O INÍCIO\",B2,Factsheet!AC15)","v":"12M"},"Maximum:",{"$f":"ROUNDUP(MAX($B$8:$D$10000),-1)","v":150}]
["End Date:",{"$f":"Factsheet!AC3:AC3","v":"2020-05-08"},"Minimum:",{"$f":"ROUNDDOWN(MIN($B$8:$D$10000),-1)","v":10}]
["Ticker:",{"$f":"Factsheet!F5","v":"PFAVH<XBOG>"},{"$f":"AtualizarLimitesGrafico(\"Factsheet\",\"Base100\",D4,D3)","v":"Base100, Min:10, Max:150"}]
[null,{"$f":"TRIM(LEFT(SUBSTITUTE(B5,\"<\",REPT(\" \",100)),20))","v":"PFAVH"}]
["Date",{"$f":"_xll.ECONOMATICA(B5,\"ticker\")","v":"PFAVH"},{"$f":"N15","v":"COLCAP RT"},"DJIA",null,{"$f":"_xll.ECOSECURITIES(\"STOCK\",\"ACTIVE\",,L15,,,,{\"Sector Economatica<>Finanzas y Seguros\";\"Index particip.>0\"})","v":{"$error":"#VALUE!"}},{"$f":"_xll.ECONOMATICA($F$8:$F$3000,\"name\")","v":"Nombre"},{"$f":"_xll.ECONOMATICA($F$8:$F$3000,\"Class\")","v":"Clase"},"Nombre y Clase","Codigo","Colombia","COL","COLCAPRT<XBOG>",{"$f":"IF(M7=\"S&P 500\",\"S&P 500\", \"COLCAP RT\")","v":"COLCAP RT"}]
[{"$f":"_xll.ECONOMATICA(B5,\"Close\",,B4,B3,\"D\",,,TRUE,FALSE,,{\"def.defdef=6\"})","v":"2019-05-08"},100,{"$f":"_xll.ECONOMATICA(M15,\"Close\",,B4,B3,\"D\",,,FALSE,FALSE,,{\"def.defdef=6\"})","v":100},{"$f":"_xll.ECONOMATICA(\"DJIA\",\"Close\",,B4,B3,\"D\",,,FALSE,FALSE,,{\"def.defdef=6\"})","v":100},null,"PFAVH<XBOG>","Avianca Holdings S.A.","Pref",{"$f":"CONCATENATE(G8,\" \",H8)","v":"Avianca Holdings S.A. Pref"},{"$f":"F8","v":"PFAVH<XBOG>"},"Chile","CHL","SP IPSA<XSGO>","IPSA"]
["2019-05-09",97.258557233144501,100.128742146189,99.4648275352083,null,"CELSIA<XBOG>","Celsia S.A. e.S.P","Ord",{"$f":"CONCATENATE(G9,\" \",H9)","v":"Celsia S.A. e.S.P Ord"},{"$f":"F9","v":"CELSIA<XBOG>"},"Estados Unidos","USA","S&P 500","S&P 500"]
["2019-05-10",98.504582241410404,100.584615201456,99.903879220597403,null,"CEMARGOS<XBOG>","Cementos Argos","Ord","Cementos Argos Ord","CEMARGOS<XBOG>","Argentina","ARG","MERVAL<XBUE>","MERVAL"]
{"$rows_left_out":2784}